---
title: AXI4总线协议FPGA实现指南：主从接口设计与验证实践
url: "https://www.fpgalearn.com/33535.html"
kind: article
id: 33535
excerpt: 本文档旨在提供一份关于在FPGA中实现AXI4总线协议主（Master）与从（Slave）接口的实战指南。AXI4（Advanced eXtensible In…
published_at: 2026-04-18
author: 二牛学FPGA
tags: AXI4, fpga, Verilog
word_count: 4768
source: "https://www.fpgalearn.com"
---

# AXI4总线协议FPGA实现指南：主从接口设计与验证实践

> 标签：AXI4、fpga、Verilog
> 本文档旨在提供一份关于在FPGA中实现AXI4总线协议主（Master）与从（Slave）接口的实战指南。AXI4（Advanced eXtensible In…

> 本文档旨在提供一份关于在FPGA中实现AXI4总线协议主（Master）与从（Slave）接口的实战指南。AXI4（Advanced eXtensible In…

本文档旨在提供一份关于在FPGA中实现AXI4总线协议主（Master）与从（Slave）接口的实战指南。AXI4（Advanced eXtensible Interface 4）是AMBA协议家族中的关键成员，以其高性能、高带宽特性，成为复杂片上系统（SoC）互连的基石。掌握其RTL级实现，是进行自定义IP设计、硬件加速器开发及系统级集成的核心能力。本指南将遵循“从原理到实现，从仿真到验证”的路径，引导读者构建一个符合协议规范、可工作的最小AXI4子系统。
## 快速上手指南
本节提供最简操作流程，帮助您快速搭建环境并运行第一个AXI4事务仿真。
- **步骤1：环境准备** – 安装Vivado 2022.1或更高版本，并确认已加载目标板卡（如Zynq-7000系列）的设备支持文件。
- **步骤2：创建工程** – 启动Vivado，创建一个新的RTL项目，选择正确的目标器件（例如：xc7z020clg400-1）。
- **步骤3：添加源文件** – 将提供的示例AXI4 Master（axi_master.v）、Slave（axi_slave.v）模块以及顶层测试模块（axi_top_tb.v）添加到工程中。
- **步骤4：配置仿真** – 在Vivado中，将仿真模式设置为“行为仿真（Behavioral Simulation）”，并将axi_top_tb指定为顶层模块。
- **步骤5：运行仿真** – 启动仿真。在波形窗口中，观察axi_top_tb实例下的信号。预期将看到Master发起一笔完整的写事务（AW、W、B通道握手），随后是一笔读事务（AR、R通道握手）。
- **步骤6：添加约束** – 创建XDC约束文件，为顶层模块的全局时钟（aclk）和复位（aresetn）信号分配物理引脚并施加时序约束。
- **步骤7：综合与实现** – 依次运行综合（Synthesis）与实现（Implementation）。检查报告，确保无严重协议违反警告，且时序收敛（Timing Met）。
- **步骤8：生成比特流** – 运行Generate Bitstream，生成FPGA配置文件。
- **步骤9：上板验证（可选）** – 将比特流下载至FPGA板卡，通过集成逻辑分析仪（ILA）抓取实际总线信号，与仿真波形进行对比验证。
- **步骤10：验收** – 仿真波形符合AXI4协议时序；综合与实现无关键错误；时序收敛。至此，一个最小可验证的AXI4主从系统搭建完成。
## 前置条件与环境配置
| 项目 | 推荐值/配置 | 说明与替代方案 |
| --- | --- | --- |
| **FPGA器件/开发板** | Xilinx 7系列 (如 Artix-7, Zynq-7000) | 本文以Zynq-7000为例。可替换为Intel Cyclone V/10等，但约束文件和IP核需相应调整。 |
| **EDA工具** | Xilinx Vivado 2022.1 | 版本需支持目标器件。Vivado HLx或WebPACK免费版均可。Intel平台请使用Quartus Prime。 |
| **仿真工具** | Vivado Simulator (XSim) | 内置仿真器，方便快捷。替代方案：ModelSim/QuestaSim，需正确配置编译库。 |
| **协议版本** | AXI4 (AXI4-Lite, AXI4-Stream 可选) | 本文聚焦AXI4 Full。AXI4-Lite更简单，适合寄存器访问；AXI4-Stream用于高速数据流。 |
| **时钟与复位** | 单时钟aclk (100 MHz)，低电平复位aresetn | AXI4要求全局时钟和复位。复位必须采用同步释放、异步断言机制。频率可根据设计调整。 |
| **接口依赖** | 无外部IP核依赖 | 本文使用纯RTL实现。实际项目中，可使用Xilinx AXI Interconnect IP或Intel Avalon-MM to AXI Bridge。 |
| **约束文件 (.xdc)** | 必需，包含时钟定义与引脚位置 | 至少需约束aclk和aresetn。若进行上板验证，需约束所有顶层I/O引脚。 |
| **验证环境** | 基于SystemVerilog的简单测试平台 | 包含Master和Slave的直连测试。可扩展为UVM环境进行随机化验证。 |
## 目标与验收标准
完成本实践后，您将获得一个功能正确的AXI4主从互连系统。可通过以下标准进行验收：
- **功能正确性**：Master能够成功发起并完成至少一笔写事务（写入特定地址和数据）和一笔读事务（从同一地址读出数据并验证）。所有五个通道（AW, W, B, AR, R）的握手（VALID/READY）时序严格符合AXI4协议规范。
- **仿真波形**：在仿真波形中，能清晰观察到一次完整的写事务（AWVALID/AWREADY → WVALID/WREADY → BVALID/BREADY）和读事务（ARVALID/ARREADY → RVALID/RREADY），且地址与数据传递准确无误。
- **综合与实现报告**：综合后无“协议违反（Protocol Violation）”相关的严重警告（Critical Warning）。实现后的静态时序分析（STA）报告显示“时序收敛（All user specified timing constraints are met）”，建立时间和保持时间均满足要求。
- **资源占用**：在目标器件上，设计占用合理的逻辑资源（LUT、FF）。作为参考，一个简单的Master和Slave对在7系列器件上通常占用不超过500个LUTs。
- **上板验证（进阶）**：通过ILA抓取的真实硬件信号波形，应与仿真波形在时序和数据上保持一致，从而证明设计在真实物理环境中工作正常。
## 详细实施步骤
### 阶段一：工程结构与模块定义
首先建立清晰的工程目录和模块划分。建议创建三个核心RTL文件：
- `axi_master.v`：实现AXI4 Master接口，核心是一个控制读写事务发起的状态机。
- `axi_slave.v`：实现AXI4 Slave接口，包含一个简单的内存模型（如32×32位RAM）用于响应读写请求。
- `axi_top.v`：顶层模块，实例化Master和Slave，并将它们的对应通道直接相连，构成一个点对点互连系统。
**常见问题与排查：**
- **问题1：信号位宽不匹配**。AXI4信号位宽（如WDATA、ARADDR）必须在模块端口声明中明确定义（例如`[31:0]`）。位宽不一致会导致综合工具报出连接错误。其根本原因在于，协议要求数据路径宽度一致以确保数据完整性。
- **问题2：复位极性错误**。AXI4协议明确规定复位信号`aresetn`为低电平有效。在顶层连接和所有模块的内部逻辑中必须统一使用低电平有效的复位逻辑，否则状态机和控制逻辑无法正确初始化，导致整个系统锁死。这是初学者最容易忽略的协议细节之一。
### 阶段二：AXI4 Slave 核心实现
Slave作为事务的响应方，其核心是一个用于存储的双端口RAM（一个端口处理AXI写数据，另一个端口处理AXI读请求）以及围绕它构建的五通道握手控制逻辑。控制逻辑需要严格遵循协议规定的状态转换，例如，必须在写数据通道（W）和写地址通道（AW）均有效后，才能生成写响应（B）。
**关键机制分析：** Slave设计的关键在于对“通道解耦”和“握手依赖”的理解。AXI4的五个通道是独立的，但事务的完成有隐含顺序。例如，读数据（R）必须与读地址（AR）通过ID关联，而写响应（B）必须在对应的写数据（W）传输完成后才能发出。在RTL实现中，这通常通过维护一个小的事务ID或地址队列来实现。
（此处预留代码片段位置，例如Slave内部写响应B通道的生成逻辑状态机）
### 阶段三：AXI4 Master 核心实现
Master作为事务的发起方，需要主动管理事务的生命周期。其核心是一个更复杂的状态机，负责在适当的时钟周期内断言各通道的VALID信号，并等待Slave的READY响应。一个典型的简单Master设计可能包含“空闲”、“发送写地址”、“发送写数据”、“等待写响应”、“发送读地址”、“接收读数据”等状态。
**风险与边界：** 在实现Master时，需特别注意“死锁”风险。例如，如果Master在Slave未准备好（READY为低）时无限期等待，而Slave又在等待Master的其他操作，则系统会陷入僵局。因此，设计时需确保状态机在所有路径上都是可推进的，或者加入超时机制。此外，对于突发（Burst）传输，Master需要正确计算地址增量并管理数据计数，这是从简单事务到复杂事务的关键跨越。
### 阶段四：仿真验证与调试
使用提供的`axi_top_tb.v`测试平台进行仿真。初始验证应专注于单一读写事务的正确性。在波形调试时，重点观察：1) 每个通道上VALID和READY信号的握手是否在时钟上升沿成功完成；2) 地址和数据在通道间传递是否准确；3) 不同通道间的时序关系是否符合协议图（例如，WLAST与WVALID的关系）。
**调试路径：** 若仿真失败，应遵循“从协议到实现”的路径排查：首先核对波形是否违反协议基本规则（如VALID在断言后不得依赖READY改变），然后检查RTL代码中状态机的转换条件是否与波形匹配，最后确认数据路径的连接是否正确。
## 扩展与进阶
- **添加突发传输**：修改Master和Slave逻辑，支持INCR类型的突发读写，实现数据带宽的有效提升。
- **集成标准IP核**：尝试用Xilinx的AXI Interconnect IP替换直连的`axi_top.v`，了解如何将自定义IP接入商用互连网络。
- **性能分析与优化**：通过仿真统计总线利用率，分析瓶颈所在。可考虑引入Outstanding交易、调整FIFO深度等方式优化性能。
- **构建UVM验证环境**：将简单测试平台升级为基于UVM的验证环境，利用其随机化、功能覆盖率和记分板机制，进行更充分和自动化的验证。
## 参考资源
- ARM, *AMBA AXI and ACE Protocol Specification* (ARM IHI 0022E)。这是最权威的协议原文，定义了一切行为的准则。
- Xilinx, *Vivado Design Suite User Guide: Logic Simulation* (UG900)。了解Vivado仿真工具的使用细节。
- Xilinx, *AXI Reference Guide* (UG1037)。提供了Xilinx平台上AXI IP的使用和集成指南。
## 附录：关键信号列表（简化版）
| 通道 | 方向 (Master视角) | 关键信号 | 说明 |
| --- | --- | --- | --- |
| 全局 | – | ACLK, ARESETn | 全局时钟与低有效复位。 |
| 写地址 (AW) | Master → Slave | AWVALID, AWREADY, AWADDR | 发起写事务的地址。 |
| 写数据 (W) | Master → Slave | WVALID, WREADY, WDATA, WLAST | 传输写数据，WLAST指示突发传输结束。 |
| 写响应 (B) | Slave → Master | BVALID, BREADY, BRESP | Slave返回的写事务完成状态。 |
| 读地址 (AR) | Master → Slave | ARVALID, ARREADY, ARADDR | 发起读事务的地址。 |
| 读数据 (R) | Slave → Master | RVALID, RREADY, RDATA, RLAST, RRESP | Slave返回的读数据及状态，RLAST指示突发结束。 |
