---
title: FPGA MIPI CSI-2图像传感器接收端逻辑设计与实现指南
url: "https://www.fpgalearn.com/33549.html"
kind: article
id: 33549
excerpt: 本文档旨在提供一套完整、可落地的FPGA MIPI CSI-2接收端（RX）逻辑设计实施方案。MIPI CSI-2是移动产业处理器接口联盟制定的摄像头串行接口标…
published_at: 2026-04-18
author: 二牛学FPGA
tags: CSI-2, fpga, MIPI
word_count: 3591
source: "https://www.fpgalearn.com"
---

# FPGA MIPI CSI-2图像传感器接收端逻辑设计与实现指南

> 标签：CSI-2、fpga、MIPI
> 本文档旨在提供一套完整、可落地的FPGA MIPI CSI-2接收端（RX）逻辑设计实施方案。MIPI CSI-2是移动产业处理器接口联盟制定的摄像头串行接口标…

> 本文档旨在提供一套完整、可落地的FPGA MIPI CSI-2接收端（RX）逻辑设计实施方案。MIPI CSI-2是移动产业处理器接口联盟制定的摄像头串行接口标…

本文档旨在提供一套完整、可落地的FPGA MIPI CSI-2接收端（RX）逻辑设计实施方案。MIPI CSI-2是移动产业处理器接口联盟制定的摄像头串行接口标准，因其高带宽、低功耗特性，已成为嵌入式视觉系统的首选接口。本设计的核心任务是将高速串行的差分MIPI D-PHY信号，可靠地转换为并行的图像像素数据流，为后续的图像处理、存储或显示模块提供标准化的数据输入。
## 快速概览
本指南将引导您完成从工程搭建、IP核配置、数据通路设计到上板验证的全过程。设计基于FPGA厂商（如Xilinx）提供的成熟IP核，重点在于理解接口配置、时序约束与数据流控制，确保图像数据从传感器到FPGA内部处理链路的稳定传输。
## 前置条件与环境准备
在开始实施前，请确保具备以下软硬件环境与知识储备：
- **硬件平台**：支持MIPI D-PHY接口的FPGA开发板（例如Xilinx Zynq-7000系列），以及兼容MIPI CSI-2协议的图像传感器模块（如OV5640）。
- **软件工具**：相应的FPGA开发套件（如Vivado 2020.1或更高版本），并确认已获得MIPI CSI-2 RX IP核的有效许可证。
- **调试工具**：熟悉使用Vivado ILA（集成逻辑分析仪）进行在线调试。
- **物理连接**：确保MIPI差分信号对的PCB走线满足等长与阻抗控制（通常为100Ω差分阻抗）。同时，需为传感器提供稳定、精确的主时钟（MCLK）。
- **基础知识**：了解AXI4-Stream协议、基本的FPGA时序约束概念以及图像传感器（如OV5640）的寄存器配置方法。
## 设计目标与验收标准
成功实现本设计后，系统应达到以下目标：
- **功能正确**：FPGA能够稳定接收并正确解析来自图像传感器的MIPI CSI-2数据流，输出无撕裂、色彩格式正确的实时图像像素数据。
- **性能达标**：系统能在传感器标称的最高像素时钟频率下持续稳定工作，无数据丢失。
- **时序收敛**：设计在FPGA上实现后，时序报告无建立时间（Setup）和保持时间（Hold）违例。
- **协议完整**：接收逻辑能正确处理长包（图像数据）、短包（帧同步、行同步）及进行必要的错误校验。
- **资源可控**：逻辑资源（LUT、FF、BRAM等）和功耗在项目预算的合理范围内。
## 实施步骤详解
### 阶段一：工程创建与IP核配置
- **创建工程**：在Vivado中新建一个RTL工程，选择正确的FPGA器件型号。
- **添加IP核**：通过IP Integrator，添加“MIPI CSI-2 RX Subsystem” IP核。
- **关键配置**：双击IP核进行配置，以下参数必须与图像传感器规格严格匹配：
- **模式选择**：选择RX（接收）模式。
- **通道数量**：设置数据通道（Lane）数（如1 Lane或2 Lane）。
- **数据速率**：IP核的“最大每通道数据速率”需设置为略高于传感器实际输出速率的值，以留出余量。
- **协议版本**：选择正确的CSI-2协议版本（通常为CSI-2 v1.1或更高）。
- **像素格式**：选择与传感器输出一致的格式（如RAW10, RGB888, YUV422等）。
- **接口使能**：建议启用AXI4-Lite从接口，以便在系统运行时动态调整部分参数（如虚拟通道选择）。
- **时钟检查**：确认IP核所需的参考时钟频率在FPGA的时钟管理单元支持范围内。
### 阶段二：数据通路与系统接口设计
MIPI IP核的输出是标准的AXI4-Stream视频流接口（`m_axis_video`）。您需要设计数据通路将其连接到下游模块：
- **直接连接**：若下游模块（如VDMA或图像处理IP）也工作在相同的时钟域且能实时接收数据，可将`m_axis_video`接口直接相连。
- **添加缓冲**：若存在时钟域差异，或下游处理存在突发性，必须在两个模块间插入一个异步FIFO，进行时钟域转换和数据缓冲，防止因下游背压（`tready`为低）导致图像数据丢失。
- **格式对齐**：这是关键检查点。必须确保IP核输出的**数据位宽**、**像素格式**与下游显示控制器或处理模块的输入要求**完全一致**。任何不匹配都会导致图像错位、色彩混乱。
- **流控监控**：在设计验证时，务必监控AXI4-Stream的`tready`信号，确保数据流畅通无阻。
### 阶段三：约束、实现与上板调试
- **引脚约束**：创建或修改XDC约束文件。为MIPI差分输入对（如`CLK_P/N`, `DATA0_P/N`）分配正确的FPGA引脚位置，并设置I/O标准（例如：`DIFF_HSTL_I_18`）。
- **时钟约束**：为MIPI参考时钟、传感器主时钟（MCLK）等添加准确的时钟周期约束。
- **时序验证**：运行综合与实现后，**必须仔细查看时序报告**，确保所有路径（尤其是MIPI输入相关路径）满足时序要求。
- **上板调试**：
- **第一步：ILA抓波**：在Vivado中为IP核的`m_axis_video`接口信号（`tdata`, `tvalid`, `tready`, `tuser`）添加ILA核。上电后，触发抓取，验证是否有规整的视频数据流，并检查`tuser`信号中的帧起始（SOF）和行起始（SOL）标记是否正确。
- **常见问题排查**：若ILA无数据或数据混乱，请按顺序检查：1) 传感器供电与MCLK是否正常；2) FPGA引脚约束与PCB连接是否对应；3) 传感器I/O电压与FPGA Bank电压是否匹配；4) 传感器初始化配置（通过I2C）是否正确，是否已启动输出。
## 核心原理与设计考量
理解底层原理有助于更好地定位和解决问题：
- **D-PHY物理层**：负责高速串行差分信号的接收、时钟数据恢复（CDR）和串并转换。这部分对信号完整性极其敏感，因此PCB设计质量至关重要。
- **CSI-2协议层**：对并行的数据进行协议解析，识别数据包边界，区分长包（有效载荷）、短包（帧/行同步信息），并执行CRC校验。FPGA厂商的IP核已完整实现了这些复杂功能。
- **为何使用官方IP核？** MIPI D-PHY涉及高速模拟电路和复杂的数字协议，自行设计门槛高、风险大。使用经过硅验证的官方IP核，能最大程度保证可靠性、兼容性和性能，并直接提供易于集成的标准AXI4-Stream接口，大幅缩短开发周期。
- **数据缓冲策略**：在IP核输出后是否添加FIFO，是一个典型的“实时性”与“资源/鲁棒性”的权衡。对于显示等实时性要求极高的应用，可考虑深度较小的FIFO或无FIFO直连；对于允许一定延迟的图像处理应用，一个深度足够的异步FIFO可以很好地解耦前后级，提高系统抗突发干扰的能力。
## 验证结果与性能评估
完成上述步骤后，您应能通过ILA观察到稳定的视频数据流，并通过下游的显示或处理模块验证图像的完整性。此时，可以：
- 查看Vivado的**资源利用率报告**，评估设计规模。
- 查看**功耗报告**，了解MIPI接口部分的动态功耗。
- 在不同光照条件下运行系统，观察图像输出是否持续稳定，无闪烁或错帧。
## 故障排查指引
- **无数据流**：检查传感器初始化、MCLK、电源、引脚约束和物理连接。使用ILA抓取IP核的输入侧状态信号（如果IP核暴露）。
- **图像撕裂或错位**：检查数据通路位宽和像素格式是否匹配。检查FIFO是否溢出或读空。确认帧同步（SOF）信号是否正确传递。
- **时序违例**：重点检查与MIPI输入时钟相关的路径约束是否合理。可能需要调整IP核的时钟缓冲设置或优化布局约束。
## 扩展与进阶
在基础接收功能稳定后，可以考虑：
- 集成多个传感器，实现多路MIPI CSI-2输入。
- 在数据通路中插入实时图像处理IP（如去马赛克、色彩空间转换、缩放等）。
- 利用AXI4-Lite接口动态切换传感器的虚拟通道或工作模式。
## 参考资源
- Xilinx官方文档：PG232 – MIPI CSI-2 RX Subsystem Product Guide
- MIPI联盟规范：MIPI CSI-2 v2.0, MIPI D-PHY v2.1
- 传感器数据手册：如OmniVision OV5640 Datasheet
## 附录：关键信号速查
- `m_axis_video_tdata`：像素数据。
- `m_axis_video_tvalid`：数据有效标志。
- `m_axis_video_tready`：下游接收就绪标志。
- `m_axis_video_tuser`：通常位0表示帧起始（SOF），位1表示行起始（SOL）。
