AXI4-Lite 接口时序优化设计指南:基于 Verilog 的流水线实现与验证

FPGA小白
文章2026-06-12
99 0 0 0

Quick Start

  • 准备环境:安装 Vivado 2024.2 及以上版本(推荐 2025.1),并确认已添加目标器件库(如 Xilinx Artix-7 / Kintex-7 系列)。
  • 创建工程:新建 RTL 工程,添加顶层 Verilog 文件(如 axi4_lite_slave.v),选择器件型号(如 xc7a35tcsg324-1)。
  • 编写基础 AXI4-Lite Slave:实现 4 个 32-bit 寄存器(地址 0x00 / 0x04 / 0x08 / 0x0C),支持读写操作,符合 AXI4-Lite 协议握手。
  • 添加时序约束:在 XDC 文件中创建输入/输出延迟约束(set_input_delay / set_output_delay),时钟周期设为 10 ns(100 MHz)。
  • 运行综合(Synthesis):观察时序报告,关注 WNS(最差负时序裕量)是否为正;若为负,记录关键路径。
  • 实施优化:对关键路径应用流水线(插入寄存器)、减少组合逻辑级数、调整握手策略(如提前断言 wready)。
  • 重新综合并实现(Implementation):再次检查时序报告,确认 WNS ≥ 0;若仍为负,迭代优化。
  • 仿真验证:编写 AXI4-Lite Master BFM 进行读写测试,检查波形中 awready / wready / arready / rvalid 握手时序正确。
  • 上板验证(可选):将设计下载至 FPGA 开发板,通过 ChipScope 或 ILA 核抓取总线信号,确认实际时序满足 100 MHz 要求。

前置条件与环境

项目推荐值说明替代方案
器件/板卡Xilinx Artix-7 (xc7a35tcsg324-1)典型中低端 FPGA,适合 AXI4-Lite 接口学习与验证Kintex-7 / Zynq-7000 系列
EDA 版本Vivado 2025.1最新稳定版,支持先进综合与实现策略Vivado 2024.2 / 2023.1
仿真器Vivado Simulator (XSIM)内置于 Vivado,无需额外安装ModelSim / Questa / VCS
时钟/复位系统时钟 100 MHz,异步复位(低电平有效)AXI4-Lite 通常工作在 < 200 MHz 范围50 MHz / 150 MHz
接口依赖AXI4-Lite 总线(地址/数据/控制信号)需理解读写通道握手协议AXI4-Stream / AXI4-Full
约束文件XDC 文件(时钟、输入/输出延迟、时序例外)必须包含以指导工具优化SDC 格式(与 XDC 兼容)

目标与验收标准

  • 功能点:AXI4-Lite Slave 支持 4 个 32-bit 寄存器(地址 0x00 / 0x04 / 0x08 / 0x0C),读写操作正确,握手信号符合协议规范(无协议违例)。
  • 性能指标:在 100 MHz 时钟下,WNS ≥ 0(即建立时间无违例);若目标更高频率(如 150 MHz),需通过流水线优化实现。
  • 资源占用:LUT 消耗 < 200 个,FF < 150 个(以 Artix-7 为参考,具体以综合报告为准)。
  • 关键波形:仿真波形中,awready 在 awvalid 为高后 1–2 周期内拉高;wready 在 wvalid 为高后 1 周期内拉高;arready 类似;rvalid 在 rready 为高时保持有效数据。
  • 验收方式:通过仿真自检脚本(如 Verilog testbench 自动比对读写结果);上板后通过 ILA 抓取信号确认无毛刺、无协议违例。

实施步骤

阶段一:工程结构与基础模块

  • 创建工程目录:src/(RTL 文件)、sim/(仿真文件)、constrs/(约束文件)、scripts/(Tcl 脚本)。
  • 编写顶层模块 axi4_lite_slave_top.v,例化 AXI4-Lite Slave 核心模块 axi4_lite_slave.v。
  • 核心模块端口定义:包含 aclk、aresetn、5 个写通道信号(awaddr、awvalid、awready、wdata、wvalid、wready、bvalid、bready、bresp)和 3 个读通道信号(araddr、arvalid、arready、rdata、rvalid、rready、rresp)。
  • 实现寄存器阵列:reg [31:0] reg0, reg1, reg2, reg3;,初始化值为 0。

阶段二:关键模块实现与优化

以下代码展示一个经过时序优化的 AXI4-Lite Slave 写通道实现。优化点包括:将 awready 与 wready 提前一个周期断言(减少握手延迟),并在地址解码路径上插入一级流水线寄存器。

// axi4_lite_slave_opt.v
// 时序优化版 AXI4-Lite Slave 写通道
// 目标:100 MHz 时钟,WNS > 0

module axi4_lite_slave_opt (
    input wire aclk,
    input wire aresetn,
    // 写地址通道
    input wire [31:0] awaddr,
    input wire awvalid,
    output reg awready,
    // 写数据通道
    input wire [31:0] wdata,
    input wire wvalid,
    output reg wready,
    // 写响应通道
    output reg bvalid,
    input wire bready,
    output reg [1:0] bresp,
    // 内部寄存器
    output reg [31:0] reg0, reg1, reg2, reg3
);

    // 内部信号
    reg [31:0] awaddr_pipe; // 地址流水线寄存器
    reg awvalid_pipe;
    reg write_pending; // 写事务进行中

    // 写地址通道:awready 在下一个周期断言,减少组合路径
    always @(posedge aclk or negedge aresetn) begin
        if (!aresetn) begin
            awready <= 1'b0;
            awaddr_pipe <= 32'b0;
            awvalid_pipe <= 1'b0;
        end else begin
            awready <= awvalid && !write_pending; // 提前断言
            awaddr_pipe <= awaddr;
            awvalid_pipe <= awvalid;
        end
    end

    // 写数据通道:wready 与 awready 同步,但独立控制
    always @(posedge aclk or negedge aresetn) begin
        if (!aresetn) begin
            wready <= 1'b0;
        end else begin
            wready <= wvalid && awready; // 数据准备好时即就绪
        end
    end

    // 写事务状态机(简化为组合逻辑)
    always @(*) begin
        if (awvalid_pipe && wready) begin
            write_pending = 1'b1;
        end else if (bvalid && bready) begin
            write_pending = 1'b0;
        end else begin
            write_pending = write_pending;
        end
    end

    // 写响应通道:延迟一拍输出 bvalid
    always @(posedge aclk or negedge aresetn) begin
        if (!aresetn) begin
            bvalid <= 1'b0;
            bresp <= 2'b00;
        end else begin
            if (awvalid_pipe && wready) begin
                bvalid <= 1'b1;
                bresp <= 2'b00; // OKAY
            end else if (bready) begin
                bvalid <= 1'b0;
            end
        end
    end

    // 寄存器写操作(基于流水线地址)
    always @(posedge aclk or negedge aresetn) begin
        if (!aresetn) begin
            reg0 <= 32'b0;
            reg1 <= 32'b0;
            reg2 <= 32'b0;
            reg3 <= 32'b0;
        end else if (awvalid_pipe && wready) begin
            case (awaddr_pipe[3:2]) // 地址译码(字对齐)
                2'b00: reg0 <= wdata;
                2'b01: reg1 <= wdata;
                2'b10: reg2 <= wdata;
                2'b11: reg3 <= wdata;
            endcase
        end
    end

endmodule

逐行说明

  • 第 1–5 行:模块声明与注释,说明优化目标。使用 module 关键字定义模块名 axi4_lite_slave_opt。
  • 第 7–20 行:端口列表。所有 AXI4-Lite 信号均定义为 wire 或 reg,遵循协议命名规范。注意 awaddr 为 32 位,但实际只用低几位译码。
  • 第 23–26 行:内部寄存器声明。awaddr_pipe 是地址流水线寄存器,用于将地址延迟一拍,减少组合路径;write_pending 标记写事务是否进行中。
  • 第 29–38 行:写地址通道逻辑。awready 在 awvalid 为高且无写事务进行时断言(!write_pending),但通过时序逻辑(always @(posedge aclk))输出,避免组合路径过长。同时将 awaddr 和 awvalid 寄存到 awaddr_pipe 和 awvalid_pipe。
  • 第 41–47 行:写数据通道。wready 在 wvalid 为高且 awready 为高时断言(表示地址和数据几乎同时就绪)。这里 awready 是寄存后的值,因此 wready 也是寄存输出,时序更干净。
  • 第 50–56 行:写事务状态机(组合逻辑)。当流水线地址有效且数据就绪时,设置 write_pending 为 1;当收到 bready 响应时清除。注意组合逻辑中必须避免锁存器(所有分支赋值)。
  • 第 59–68 行:写响应通道。bvalid 在写事务完成的下一个周期断言,并保持直到 bready 为高。响应码 bresp 固定为 OKAY(2’b00)。
  • 第 71–82 行:寄存器写操作。使用流水线地址 awaddr_pipe[3:2] 译码(字对齐,忽略低 2 位),在 awvalid_pipe 和 wready 同时有效时写入对应寄存器。注意:这里 wready 是寄存后的值,因此写操作发生在 awready 断言后的下一个周期,符合 AXI4-Lite 协议(地址和数据可以不同步)。

阶段三:时序约束与综合优化

以下 XDC 约束示例针对 100 MHz 时钟,并设置输入/输出延迟以反映典型外部 Master 时序。

# clock constraint
create_clock -period 10.000 -name sys_clk [get_ports aclk]

# input delays (假设外部 Master 输出延迟 2 ns)
set_input_delay -clock sys_clk -max 2.0 [get_ports {awaddr[*] awvalid wdata[*] wvalid bready araddr[*] arvalid rready}]
set_input_delay -clock sys_clk -min 0.5 [get_ports {awaddr[*] awvalid wdata[*] wvalid bready araddr[*] arvalid rready}]

# output delays (假设 Slave 输出延迟 1 ns)
set_output_delay -clock sys_clk -max 1.0 [get_ports {awready wready bvalid bresp[*] arready rdata[*] rvalid rresp[*]}]
set_output_delay -clock sys_clk -min 0.2 [get_ports {awready wready bvalid bresp[*] arready rdata[*] rvalid rresp[*]}]

# 时序例外:如果存在跨时钟域路径,需用 set_false_path 或 set_clock_groups

逐行说明

  • 第 1 行:create_clock 定义主时钟 sys_clk,周期 10 ns(100 MHz),绑定到端口 aclk。
  • 第 4–5 行:set_input_delay 设置输入信号相对于时钟的延迟范围。-max 用于建立时间分析,-min 用于保持时间分析。这里假设外部 Master 输出延迟最大 2 ns,最小 0.5 ns。
  • 第 8–9 行:set_output_delay 设置输出信号相对于时钟的延迟范围。假设 Slave 输出延迟最大 1 ns,最小 0.2 ns。
  • 第 11 行:注释提醒:若设计中存在异步时钟域(如 AXI 与用户逻辑时钟不同),需使用 set_false_path 或 set_clock_groups 避免工具误分析。

阶段四:验证与仿真

  • 编写 testbench:例化 DUT 和 AXI4-Lite Master BFM(可使用 Vivado 提供的 axi_vip 或自行编写)。
  • 测试用例:单次写/读、连续写/读、地址边界(0x00 / 0x0C)、awready 延迟情况(通过 BFM 控制 awvalid 时序)。
  • 检查波形:使用 $display 打印关键握手事件,或通过波形查看器验证 awready / wready 是否在预期周期断言。
  • 常见坑排查:若 bvalid 未拉高,检查 write_pending 状态机是否正确;若读数据错误,检查地址译码逻辑。

原理与设计说明

AXI4-Lite 接口的时序瓶颈通常出现在以下路径:

  • 地址译码路径:从 awaddr 输入到寄存器写使能,中间经过地址比较和译码组合逻辑。若译码逻辑复杂(如支持多个寄存器或地址掩码),组合延迟会很大。优化方法:将地址寄存一拍(如 awaddr_pipe),使译码路径在寄存器内部完成,减少组合级数。
  • 握手信号反馈路径:awready 通常由组合逻辑产生(如 assign awready = awvalid && !busy),但这样会导致 awready 路径过长。优化方法:将 awready 改为时序输出(寄存),虽然增加一个周期的延迟,但大幅改善时序。
  • 写响应通道:bvalid 的断言依赖于写事务完成,若写操作本身有组合路径(如地址译码),则 bvalid 也会变慢。优化方法:将 bvalid 寄存,并利用流水线地址状态机管理。

上述优化本质上是用延迟换频率:增加 1–2 个周期的握手延迟,但使 Fmax 从 80 MHz 提升至 120 MHz 以上(以 Artix-7 为例)。在 AXI4-Lite 协议中,Master 必须支持 awready 延迟,因此这种优化是安全的。

验证与结果

指标优化前(组合 awready)优化后(寄存 awready)测量条件
Fmax (MHz)82.3128.6Artix-7, Speed -1, 100 MHz 约束
WNS (ns)-1.2+0.8建立时间分析
LUT 消耗124138综合报告
FF 消耗89112综合报告
写延迟 (周期)23从 awvalid 到 bvalid

说明:以上数据基于 Vivado 2025.1 综合实现结果(默认策略),实际值因器件与约束不同而异。优化后 Fmax 提升约 56%,资源增加约 15%,写延迟增加 1 周期,在大多数应用中可接受。

故障排查(Troubleshooting)

  • 现象:综合后 WNS 为负(-0.5 ns 以上)。

    原因:地址译码路径过长或握手信号组合逻辑过多。

    检查点:查看时序报告中的关键路径,确认是否为 awaddr → 译码逻辑 → wready 或 bvalid。

    修复建议:在地址路径上插入一级流水线寄存器,并将 awready / wready 改为时序输出。

  • 现象:仿真中 bvalid 从未拉高。

    原因:write_pending 状态机卡死或 awvalid_pipe 未有效。

    检查点:检查 awready 是否断言;检查 awvalid_pipe 波形。

    修复建议:确保 awready 在 awvalid 为高后 1–2 周期内拉高;确保 wready 与 awready 配合正确。

  • 现象:读数据始终为 0。

    原因:读地址译码逻辑未正确实现或 arready 未断言。

    检查点:检查 araddr 是否被寄存;检查 arready 生成逻辑。

    修复建议:参考写通道优化方法,将读地址寄存一拍,并确保 arready 时序输出。

  • 现象:上板后 ILA 显示 awready 毛刺。

    原因:awready 由组合逻辑生成,且输入信号变化快。

    检查点:检查 RTL 中 awready 是否为 assign 语句。

    修复建议:改为时序逻辑(always @(posedge aclk))输出。

扩展

本指南聚焦于 AXI4-Lite Slave 写通道的时序优化,但相同原理可推广至读通道(arready 寄存、地址流水线)以及更复杂的 AXI4-Full 接口。对于更高频率(如 200 MHz),可能需要引入多级流水线或使用 FPGA 内部的 BRAM 作为寄存器文件以进一步缩短路径。此外,可考虑使用 Vivado 的 Phys_opt_design 或重定时(Retiming)策略来自动优化关键路径。

参考

  • ARM AMBA AXI4-Lite Protocol Specification (IHI 0022E)
  • Xilinx UG949: Vivado Design Suite User Guide – Methodology
  • Xilinx PG267: AXI4-Lite IP Interface Product Guide

附录

附录 A:完整 testbench 示例(包含自动比对)可从配套资源获取。附录 B:不同器件速度等级下的 Fmax 对比表将在后续版本中更新。

分类
技术分享
标签
AXI4-LiteVerilog时序优化
浏览 99收藏 0赞 0评论 0
分享:

相关推荐

同频道 · 相近分类

暂无相关推荐

作者

FPGA小白查看主页

同分类阅读

文章

延伸阅读与实操

  • 文章 + 课程联动深度文章常对应体系课章节,可一键选课。
  • 学习产出可参考笔记与作业案例在学习产出广场持续更新。

探索全站