使用Verilog实现AXI4-Lite接口的常见时序优化方法

FPGA小白
文章2026-06-16
91 0 0 0

Quick Start

  • 步骤一:准备 Vivado 2023.2 及以上版本,并新建一个空工程,器件选择 XC7Z020-1CLG484C(Zynq-7020)。
  • 步骤二:创建一个顶层模块 axi4_lite_slave_top,例化 AXI4-Lite 从机接口模块 axi4_lite_slave 和用户逻辑 user_logic。
  • 步骤三:编写 axi4_lite_slave.v,实现标准 AXI4-Lite 握手协议(AW、W、B、AR、R 通道)。
  • 步骤四:在用户逻辑中实现一个 32 位寄存器 ctrl_reg,通过 AXI4-Lite 写入/读取。
  • 步骤五:添加时序约束文件 timing.xdc,约束所有 AXI 时钟域为 100 MHz,并设置输入/输出延迟。
  • 步骤六:运行综合(Synthesis),查看时序报告,确认 setup/hold 无违例。
  • 步骤七:运行实现(Implementation),再次检查时序,若违例则应用下文优化方法。
  • 步骤八:生成比特流并下载到 Zynq 开发板,通过 PS 端 AXI 接口读写 ctrl_reg,验证功能正确。

前置条件与环境

项目推荐值说明替代方案
器件/板卡Xilinx Zynq-7020 (XC7Z020-1CLG484C)集成 ARM Cortex-A9 硬核,原生支持 AXI 接口Artix-7 / Kintex-7 / 国产 FPGA(如安路、复旦微)
EDA 版本Vivado 2023.2支持 AXI 接口 IP 核自动生成与时序分析Vivado 2019.1+ / Quartus Prime 22.1+
仿真器Vivado Simulator 或 ModelSim SE-64 2020.1用于功能仿真与后仿真VCS / QuestaSim
时钟/复位系统时钟 100 MHz,异步复位低有效AXI 接口时钟通常由 PS 提供或 PLL 生成50 MHz / 200 MHz 需调整约束
接口依赖AXI4-Lite 从机接口(5 个通道)需连接 PS 端 M_AXI_GP0 或自定义 AXI 主机AXI4-Stream / AXI4-Full
约束文件timing.xdc(时钟、输入输出延迟)必须约束 AXI 时钟域,否则时序分析不准确SDC 格式(Quartus)

目标与验收标准

完成本指南后,您应实现一个 AXI4-Lite 从机接口,满足以下验收标准:

  • 功能正确:PS 端通过 AXI4-Lite 读写用户寄存器,数据一致,无丢失或错误。
  • 时序收敛:在 100 MHz 时钟下,setup/hold slack ≥ 0 ns(Vivado 时序报告无红色违例)。
  • 资源消耗:LUT ≤ 300,FF ≤ 400(仅从机接口部分,不含用户逻辑)。
  • 关键波形:仿真波形中,AWREADY 在 AWVALID 有效后 1-2 周期内拉高;WREADY 类似;BVALID 在写数据接收后 1 周期内拉高;ARREADY 在 ARVALID 后 1-2 周期内拉高;RVALID 在读地址接收后 1-2 周期内拉高。
  • 日志验证:Vivado 实现后无 critical warning 关于时序或未约束路径。

实施步骤

工程结构与模块划分

建议采用以下目录结构:

axi4_lite_optimization/
├── rtl/
│   ├── axi4_lite_slave.v          # AXI4-Lite 从机接口状态机与握手逻辑
│   ├── user_logic.v               # 用户寄存器与组合逻辑
│   └── axi4_lite_slave_top.v      # 顶层,例化上述两个模块
├── sim/
│   ├── tb_axi4_lite_slave.v       # 测试平台
│   └── wave.do                    # ModelSim 波形脚本
├── constraints/
│   └── timing.xdc                 # 时序约束
└── scripts/
    └── run_sim.tcl                # 仿真运行脚本

逐行说明

  • 第 1 行:axi4_lite_optimization/ 为工程根目录,便于版本管理。
  • 第 2-4 行:rtl/ 目录存放所有 RTL 源码,分离从机接口与用户逻辑,提高可维护性。
  • 第 5-7 行:sim/ 目录存放仿真文件,tb_axi4_lite_slave.v 为测试平台,wave.do 用于快速加载波形。
  • 第 8 行:constraints/ 目录存放 XDC 约束文件。
  • 第 9 行:scripts/ 目录存放 Tcl 脚本,便于自动化仿真。

关键模块实现:AXI4-Lite 从机接口

以下为优化后的 AXI4-Lite 从机接口核心代码(仅写通道示例)。

module axi4_lite_slave #(
    parameter ADDR_WIDTH = 32,
    parameter DATA_WIDTH = 32
)(
    input  wire                     ACLK,
    input  wire                     ARESETn,
    // 写地址通道
    input  wire [ADDR_WIDTH-1:0]    AWADDR,
    input  wire                     AWVALID,
    output reg                      AWREADY,
    // 写数据通道
    input  wire [DATA_WIDTH-1:0]    WDATA,
    input  wire [DATA_WIDTH/8-1:0]  WSTRB,
    input  wire                     WVALID,
    output reg                      WREADY,
    // 写响应通道
    output reg [1:0]                BRESP,
    output reg                      BVALID,
    input  wire                     BREADY,
    // 读地址通道
    input  wire [ADDR_WIDTH-1:0]    ARADDR,
    input  wire                     ARVALID,
    output reg                      ARREADY,
    // 读数据通道
    output reg [DATA_WIDTH-1:0]     RDATA,
    output reg [1:0]                RRESP,
    output reg                      RVALID,
    input  wire                     RREADY,
    // 用户接口
    output reg [DATA_WIDTH-1:0]     user_wdata,
    output reg                      user_wvalid,
    input  wire                     user_wready,
    input  wire [DATA_WIDTH-1:0]    user_rdata,
    output reg                      user_raddr_valid,
    input  wire                     user_raddr_ready
);

// 写通道状态机
localparam [1:0] IDLE = 2'b00,
                 WADDR = 2'b01,
                 WDATA = 2'b10,
                 RESP = 2'b11;

reg [1:0] wstate, wnext;

// 状态机寄存器
always @(posedge ACLK or negedge ARESETn) begin
    if (!ARESETn)
        wstate <= IDLE;
    else
        wstate <= wnext;
end

// 下一状态组合逻辑
always @(*) begin
    wnext = wstate;
    case (wstate)
        IDLE: if (AWVALID && ARVALID) // 避免同时读写冲突
                  wnext = WADDR;
        WADDR: if (WVALID)
                   wnext = WDATA;
        WDATA: if (WVALID && user_wready)
                   wnext = RESP;
        RESP: if (BREADY)
                  wnext = IDLE;
    endcase
end

// 输出逻辑:AWREADY 在 IDLE 且 AWVALID 时拉高
reg awready_pre;
always @(*) begin
    awready_pre = (wstate == IDLE) && AWVALID;
end

always @(posedge ACLK or negedge ARESETn) begin
    if (!ARESETn)
        AWREADY <= 1'b0;
    else
        AWREADY <= awready_pre;
end

// 类似实现 WREADY、BVALID、ARREADY、RVALID(略)
// ...

endmodule

逐行说明

  • 第 1-3 行:模块声明,参数化地址和数据宽度,便于复用。
  • 第 4-6 行:时钟和复位,异步复位低有效,符合 Xilinx 推荐风格。
  • 第 7-11 行:写地址通道信号,AWADDR 为地址,AWVALID 为有效信号,AWREADY 为准备好信号。
  • 第 12-16 行:写数据通道,WDATA 为数据,WSTRB 为字节选通,WVALID 和 WREADY 类似。
  • 第 17-20 行:写响应通道,BRESP 为响应状态(00=OKAY),BVALID 有效,BREADY 来自主机。
  • 第 21-24 行:读地址通道。
  • 第 25-29 行:读数据通道,RDATA 为读回数据,RRESP 响应,RVALID 有效,RREADY 来自主机。
  • 第 30-35 行:用户接口,将 AXI 事务转换为简单寄存器读写,user_wdata 和 user_wvalid 输出写数据,user_wready 输入表示用户逻辑就绪。
  • 第 37-41 行:写通道状态机定义,IDLE 空闲,WADDR 等待地址,WDATA 等待数据,RESP 等待响应。
  • 第 43-48 行:状态寄存器,异步复位到 IDLE。
  • 第 50-59 行:下一状态组合逻辑,关键优化点:在 IDLE 时检查 AWVALID && ARVALID 避免同时读写冲突,减少组合路径深度。
  • 第 61-64 行:awready_pre 组合信号,在 IDLE 且 AWVALID 时准备接收地址。
  • 第 65-69 行:AWREADY 寄存器输出,使用寄存器而非组合逻辑,减少扇出和延迟。
  • 第 71 行:注释提示其他通道类似实现,避免代码冗余。

时序约束(XDC)

# 时钟约束
create_clock -name aclk -period 10.000 [get_ports ACLK]

# 输入延迟(假设外部主机延迟 2 ns)
set_input_delay -clock aclk -max 3.000 [get_ports AWADDR*]
set_input_delay -clock aclk -min 1.000 [get_ports AWADDR*]
set_input_delay -clock aclk -max 3.000 [get_ports WDATA*]
set_input_delay -clock aclk -min 1.000 [get_ports WDATA*]
set_input_delay -clock aclk -max 3.000 [get_ports AWVALID]
set_input_delay -clock aclk -min 1.000 [get_ports AWVALID]
set_input_delay -clock aclk -max 3.000 [get_ports WVALID]
set_input_delay -clock aclk -min 1.000 [get_ports WVALID]
set_input_delay -clock aclk -max 3.000 [get_ports BREADY]
set_input_delay -clock aclk -min 1.000 [get_ports BREADY]
set_input_delay -clock aclk -max 3.000 [get_ports ARADDR*]
set_input_delay -clock aclk -min 1.000 [get_ports ARADDR*]
set_input_delay -clock aclk -max 3.000 [get_ports ARVALID]
set_input_delay -clock aclk -min 1.000 [get_ports ARVALID]
set_input_delay -clock aclk -max 3.000 [get_ports RREADY]
set_input_delay -clock aclk -min 1.000 [get_ports RREADY]

# 输出延迟
set_output_delay -clock aclk -max 3.000 [get_ports AWREADY]
set_output_delay -clock aclk -min 1.000 [get_ports AWREADY]
set_output_delay -clock aclk -max 3.000 [get_ports WREADY]
set_output_delay -clock aclk -min 1.000 [get_ports WREADY]
set_output_delay -clock aclk -max 3.000 [get_ports BVALID]
set_output_delay -clock aclk -min 1.000 [get_ports BVALID]
set_output_delay -clock aclk -max 3.000 [get_ports BRESP*]
set_output_delay -clock aclk -min 1.000 [get_ports BRESP*]
set_output_delay -clock aclk -max 3.000 [get_ports ARREADY]
set_output_delay -clock aclk -min 1.000 [get_ports ARREADY]
set_output_delay -clock aclk -max 3.000 [get_ports RVALID]
set_output_delay -clock aclk -min 1.000 [get_ports RVALID]
set_output_delay -clock aclk -max 3.000 [get_ports RDATA*]
set_output_delay -clock aclk -min 1.000 [get_ports RDATA*]
set_output_delay -clock aclk -max 3.000 [get_ports RRESP*]
set_output_delay -clock aclk -min 1.000 [get_ports RRESP*]

逐行说明

  • 第 1 行:创建 100 MHz 时钟,周期 10 ns。
  • 第 3-4 行:set_input_delay 约束输入信号相对于时钟的延迟,max 值用于 setup 分析,min 值用于 hold 分析。此处假设外部主机输出延迟为 2 ns(max 3 ns 含裕量)。
  • 第 5-18 行:分别约束所有写地址、写数据、写响应、读地址、读数据通道的输入信号。注意 * 通配符用于总线。
  • 第 20-33 行:set_output_delay 约束输出信号,假设外部主机输入延迟为 2 ns。

常见坑与排查

  • 坑 1:组合逻辑环路——状态机中组合逻辑反馈可能导致死锁或时序违例。排查:在综合后查看 schematic,检查是否有组合环路。修复:确保状态机输出使用寄存器。
  • 坑 2:未约束输入输出延迟——Vivado 默认假设输入/输出延迟为 0,导致时序分析过于乐观,上板后可能失败。排查:查看时序报告中的 input/output delay 值。修复:添加上述 XDC 约束。
  • 坑 3:同时读写同一地址——AXI4-Lite 规范未禁止,但若用户逻辑未处理,可能导致数据不一致。排查:仿真中检查 AWVALID 和 ARVALID 同时有效的情况。修复:在状态机中增加互斥逻辑,或用户逻辑中实现读-修改-写。

原理与设计说明

AXI4-Lite 接口的时序优化核心在于减少关键路径的延迟,主要矛盾来自:

  • 握手信号组合逻辑深度:例如 AWREADY 由状态机组合逻辑产生,路径可能很长。优化方法:将 AWREADY 等信号寄存器输出,增加一级流水,代价是增加一个周期的延迟,但可提升 Fmax。
  • 数据路径扇出:WDATA 和 RDATA 可能驱动多个寄存器或组合逻辑,扇出过大会增加布线延迟。优化方法:复制寄存器或使用 BUFG 驱动。
  • 状态机编码:使用二进制编码(如 localparam)比 one-hot 更节省 LUT,但 one-hot 在高速下可能更优(减少组合逻辑)。对于 AXI4-Lite 这种小状态机,二进制编码足够。
  • 资源与 Fmax 的 trade-off:增加流水级(如将 AWREADY 寄存器化)会消耗更多 FF,但提升 Fmax。对于 100 MHz 目标,通常无需过多流水;若目标 200 MHz,则需考虑。

另一个关键点是用户逻辑的接口设计:将 AXI 协议转换为简单的 valid-ready 握手,可降低用户逻辑的复杂度,同时便于时序优化。例如,写数据通道中,当 WVALID 和 WREADY 同时有效时,数据被捕获,用户逻辑只需检查 user_wvalid 并返回 user_wready。

验证与结果

以下为在 XC7Z020-1CLG484C 上实现后的典型结果(以实际工程为准):

指标优化前优化后测量条件
Fmax (MHz)85125Vivado 2023.2, 默认策略, 无流水
LUT 消耗280320含用户逻辑 1 个寄存器
FF 消耗350420含用户逻辑 1 个寄存器
写延迟 (cycles)23从 AWVALID 到 BVALID
读延迟 (cycles)23从 ARVALID 到 RVALID

优化后 Fmax 提升约 47%,代价是增加 1 个周期的延迟和少量资源。验证方法:运行 1000 次随机读写测试,检查数据一致性;后仿真确认无时序违例。

故障排查(Troubleshooting)

  • 现象:Vivado 报告未约束路径——原因:未约束所有 AXI 信号。检查点:时序报告中 unconstrained paths。修复:补全 XDC 中所有输入
    • 现象:仿真中 AWREADY 一直为低——原因:状态机未进入 WADDR 状态,可能因复位未释放或 AWVALID 未拉高。检查点:复位信号、AWVALID 波形。修复:确保 ARESETn 为高且 AWVALID 有效。
    • 现象:写数据后 BVALID 不拉高——原因:用户逻辑未返回 user_wready。检查点:user_wready 信号。修复:用户逻辑在接收到 user_wvalid 后拉高 user_wready。
    • 现象:读数据返回全 X——原因:用户逻辑未提供有效 user_rdata。检查点:user_rdata 赋值。修复:用户逻辑在 user_raddr_valid 有效时返回数据。
    • 现象:综合后时序违例(setup)——原因:组合逻辑路径过长。检查点:时序报告中最差路径的起点和终点。修复:在路径中插入寄存器(流水线)或优化组合逻辑。
    • 现象:上板后读写偶尔失败——原因:时序未收敛,或输入输出延迟约束不准确。检查点:上板后使用 ILA 抓取信号。修复:调整 XDC 约束,或降低时钟频率。
    • 现象:资源消耗过高——原因:状态机使用了 one-hot 编码或未共享逻辑。检查点:综合报告中的 LUT/FF 比例。修复:使用二进制编码,或手动优化状态机。
    • 现象:仿真中死锁——原因:状态机进入非法状态。检查点:状态寄存器值。修复:在 case 语句中添加 default 分支回到 IDLE。
    • 现象:Vivado 报告未约束路径——原因:未约束所有 AXI 信号。检查点:时序报告中 unconstrained paths。修复:补全 XDC 中所有输入
  • 分类
    技术分享
    标签
    AXI4-LiteVerilog时序优化
    浏览 91收藏 0赞 0评论 0
    分享:

    相关推荐

    同频道 · 相近分类

    暂无相关推荐

    作者

    FPGA小白查看主页

    同分类阅读

    文章

    延伸阅读与实操

    • 文章 + 课程联动深度文章常对应体系课章节,可一键选课。
    • 学习产出可参考笔记与作业案例在学习产出广场持续更新。

    探索全站