Quick Start
- 打开 Vivado 2024.2(或更高版本),创建新工程,器件选择 XC7A35T-1CSG324C(Artix-7 示例)。
- 添加 AXI4 主/从接口 RTL 文件(如自定义 AXI4-Lite 从机模块)。
- 运行综合(Synthesis),等待完成。
- 打开综合后的设计(Open Synthesized Design),点击“Report Timing Summary”,确认无违例。
- 若存在违例,打开“Constraints Wizard”,选择“AXI4 Interface”模板,自动生成基本时序约束。
- 手动添加输出延迟约束(set_output_delay)与输入延迟约束(set_input_delay),覆盖 AXI4 的 ACK、VALID、DATA 信号。
- 重新综合并实现(Implementation),再次运行时序报告,观察 setup/hold 违例是否消除。
- 若仍违例,启用“Physically Aware Synthesis”或调整逻辑深度,重复步骤 5-7 直至通过。
预期结果:时序报告显示所有 AXI4 接口路径的 setup slack ≥ 0,hold slack ≥ 0。
前置条件与环境
| 项目 | 推荐值 | 说明 | 替代方案 |
|---|---|---|---|
| 器件/板卡 | Xilinx Artix-7 XC7A35T | 主流低成本 FPGA,AXI4 接口广泛使用 | Kintex-7 / Zynq-7000 |
| EDA 版本 | Vivado 2024.2 | 支持 AXI4 约束模板与自动推导 | Vivado 2023.x / ISE(不推荐) |
| 仿真器 | Vivado Simulator 或 ModelSim SE-64 2024 | 用于功能验证与时序仿真 | VCS / Questa |
| 时钟/复位 | 系统时钟 100 MHz,异步复位低有效 | AXI4 接口时钟通常由主设备提供 | 外部晶振 50 MHz(需 PLL 倍频) |
| 接口依赖 | AXI4-Lite 或 AXI4-Full 从机接口 | 需明确主/从角色与数据宽度(32/64 bit) | AXI4-Stream |
| 约束文件 | XDC 文件(至少包含 create_clock, set_input_delay, set_output_delay) | 约束必须覆盖所有 AXI4 信号组 | SDC 格式(Vivado 自动转换) |
目标与验收标准
完成以下验收点即视为成功:
- 所有 AXI4 接口路径(AW、W、B、AR、R 通道)的 setup slack ≥ 0 ps,hold slack ≥ 0 ps。
- Fmax 达到或超过目标时钟频率(示例:100 MHz 时钟下,Fmax ≥ 100 MHz)。
- 资源利用率:LUT ≤ 500,FF ≤ 600(仅 AXI4 从机逻辑,以实际工程为准)。
- 功能仿真通过:AXI4 读/写事务无数据错误,VALID 与 READY 握手正确。
- 上板测试(如适用):通过 AXI4 主设备(如 Zynq PS)读写从机寄存器,回读数据一致。
实施步骤
工程结构
- 创建 Vivado 工程,添加顶层文件(top.v)与 AXI4 从机模块(axi_slave.v)。
- 在顶层中例化从机模块,连接时钟(s_axi_aclk)、复位(s_axi_aresetn)与 AXI4 接口信号。
- 添加约束文件(top.xdc),包含时钟定义与 I/O 延迟约束。
关键模块:AXI4-Lite 从机(示例)
module axi_slave (
input wire s_axi_aclk,
input wire s_axi_aresetn,
input wire [31:0] s_axi_awaddr,
input wire [2:0] s_axi_awprot,
input wire s_axi_awvalid,
output wire s_axi_awready,
input wire [31:0] s_axi_wdata,
input wire [3:0] s_axi_wstrb,
input wire s_axi_wvalid,
output wire s_axi_wready,
output wire [1:0] s_axi_bresp,
output wire s_axi_bvalid,
input wire s_axi_bready,
input wire [31:0] s_axi_araddr,
input wire [2:0] s_axi_arprot,
input wire s_axi_arvalid,
output wire s_axi_arready,
output wire [31:0] s_axi_rdata,
output wire [1:0] s_axi_rresp,
output wire s_axi_rvalid,
input wire s_axi_rready
);
reg [31:0] mem [0:255];
reg awready_reg, wready_reg, bvalid_reg, arready_reg, rvalid_reg;
reg [31:0] rdata_reg;
reg [1:0] bresp_reg, rresp_reg;
// 写地址通道
always @(posedge s_axi_aclk or negedge s_axi_aresetn) begin
if (!s_axi_aresetn) begin
awready_reg <= 1'b0;
end else begin
awready_reg <= s_axi_awvalid && !awready_reg;
end
end
assign s_axi_awready = awready_reg;
// 写数据通道
always @(posedge s_axi_aclk or negedge s_axi_aresetn) begin
if (!s_axi_aresetn) begin
wready_reg <= 1'b0;
end else begin
wready_reg <= s_axi_wvalid && !wready_reg;
end
end
assign s_axi_wready = wready_reg;
// 写响应通道
always @(posedge s_axi_aclk or negedge s_axi_aresetn) begin
if (!s_axi_aresetn) begin
bvalid_reg <= 1'b0;
bresp_reg <= 2'b00;
end else if (awready_reg && wready_reg) begin
bvalid_reg <= 1'b1;
bresp_reg <= 2'b00; // OKAY
end else if (s_axi_bready) begin
bvalid_reg <= 1'b0;
end
end
assign s_axi_bresp = bresp_reg;
assign s_axi_bvalid = bvalid_reg;
// 读地址通道
always @(posedge s_axi_aclk or negedge s_axi_aresetn) begin
if (!s_axi_aresetn) begin
arready_reg <= 1'b0;
end else begin
arready_reg <= s_axi_arvalid && !arready_reg;
end
end
assign s_axi_arready = arready_reg;
// 读数据通道
always @(posedge s_axi_aclk or negedge s_axi_aresetn) begin
if (!s_axi_aresetn) begin
rvalid_reg <= 1'b0;
rresp_reg <= 2'b00;
rdata_reg <= 32'h0;
end else if (arready_reg) begin
rvalid_reg <= 1'b1;
rresp_reg <= 2'b00;
rdata_reg <= mem[s_axi_araddr[9:2]];
end else if (s_axi_rready) begin
rvalid_reg <= 1'b0;
end
end
assign s_axi_rdata = rdata_reg;
assign s_axi_rresp = rresp_reg;
assign s_axi_rvalid = rvalid_reg;
endmodule逐行说明
- 第 1 行:模块声明,定义 AXI4-Lite 从机接口信号,包括时钟、复位、写地址通道(AW)、写数据通道(W)、写响应通道(B)、读地址通道(AR)、读数据通道(R)。
- 第 2 行:声明内部寄存器 mem,用于存储 256 个 32 位寄存器。
- 第 3 行:声明各通道的 ready/valid 寄存器。
- 第 4 行:写地址通道 always 块,在时钟上升沿或复位下降沿触发;复位时 awready_reg 清零;否则当 awvalid 有效且 awready 未拉高时,拉高 awready_reg(单周期脉冲)。
- 第 5 行:assign s_axi_awready = awready_reg,将寄存器值输出到端口。
- 第 6 行:写数据通道 always 块,逻辑与写地址通道类似,产生 wready 脉冲。
- 第 7 行:写响应通道 always 块,当 awready 和 wready 同时有效时,拉高 bvalid 并设置 bresp 为 OKAY;当 bready 有效时,清零 bvalid。
- 第 8 行:读地址通道 always 块,产生 arready 脉冲。
- 第 9 行:读数据通道 always 块,当 arready 有效时,从 mem 读取数据并拉高 rvalid;当 rready 有效时,清零 rvalid。
- 第 10 行:输出赋值,将内部寄存器连接到端口。
时序约束:输入延迟
# 时钟定义
create_clock -name clk -period 10.000 [get_ports s_axi_aclk]
# 输入延迟:写地址通道(AW)
set_input_delay -clock clk -max 5.000 [get_ports s_axi_awaddr*]
set_input_delay -clock clk -min 1.000 [get_ports s_axi_awaddr*]
set_input_delay -clock clk -max 5.000 [get_ports s_axi_awvalid]
set_input_delay -clock clk -min 1.000 [get_ports s_axi_awvalid]
# 输入延迟:写数据通道(W)
set_input_delay -clock clk -max 5.000 [get_ports s_axi_wdata*]
set_input_delay -clock clk -min 1.000 [get_ports s_axi_wdata*]
set_input_delay -clock clk -max 5.000 [get_ports s_axi_wvalid]
set_input_delay -clock clk -min 1.000 [get_ports s_axi_wvalid]
set_input_delay -clock clk -max 5.000 [get_ports s_axi_wstrb*]
set_input_delay -clock clk -min 1.000 [get_ports s_axi_wstrb*]
# 输入延迟:读地址通道(AR)
set_input_delay -clock clk -max 5.000 [get_ports s_axi_araddr*]
set_input_delay -clock clk -min 1.000 [get_ports s_axi_araddr*]
set_input_delay -clock clk -max 5.000 [get_ports s_axi_arvalid]
set_input_delay -clock clk -min 1.000 [get_ports s_axi_arvalid]
# 输入延迟:写响应通道(B)的 bready
set_input_delay -clock clk -max 5.000 [get_ports s_axi_bready]
set_input_delay -clock clk -min 1.000 [get_ports s_axi_bready]
# 输入延迟:读数据通道(R)的 rready
set_input_delay -clock clk -max 5.000 [get_ports s_axi_rready]
set_input_delay -clock clk -min 1.000 [get_ports s_axi_rready]逐行说明
- 第 1 行:创建时钟 clk,周期 10 ns(100 MHz),绑定到 s_axi_aclk 端口。
- 第 2 行:对写地址信号(awaddr)设置最大输入延迟 5 ns,最小 1 ns。max 用于 setup 分析,min 用于 hold 分析。值根据 PCB 走线延迟估算(示例值,实际需根据板级参数调整)。
- 第 3 行:对 awvalid 设置相同延迟。
- 第 4 行:对写数据信号(wdata, wvalid, wstrb)设置输入延迟。
- 第 5 行:对读地址信号(araddr, arvalid)设置输入延迟。
- 第 6 行:对写响应通道的 bready 设置输入延迟(bready 是从机输入,由主设备驱动)。
- 第 7 行:对读数据通道的 rready 设置输入延迟。
时序约束:输出延迟
# 输出延迟:写响应通道(B)
set_output_delay -clock clk -max 6.000 [get_ports s_axi_bresp*]
set_output_delay -clock clk -min 1.000 [get_ports s_axi_bresp*]
set_output_delay -clock clk -max 6.000 [get_ports s_axi_bvalid]
set_output_delay -clock clk -min 1.000 [get_ports s_axi_bvalid]
# 输出延迟:读数据通道(R)
set_output_delay -clock clk -max 6.000 [get_ports s_axi_rdata*]
set_output_delay -clock clk -min 1.000 [get_ports s_axi_rdata*]
set_output_delay -clock clk -max 6.000 [get_ports s_axi_rresp*]
set_output_delay -clock clk -min 1.000 [get_ports s_axi_rresp*]
set_output_delay -clock clk -max 6.000 [get_ports s_axi_rvalid]
set_output_delay -clock clk -min 1.000 [get_ports s_axi_rvalid]
# 输出延迟:写地址/数据通道的 ready(从机输出)
set_output_delay -clock clk -max 6.000 [get_ports s_axi_awready]
set_output_delay -clock clk -min 1.000 [get_ports s_axi_awready]
set_output_delay -clock clk -max 6.000 [get_ports s_axi_wready]
set_output_delay -clock clk -min 1.000 [get_ports s_axi_wready]
set_output_delay -clock clk -max 6.000 [get_ports s_axi_arready]
set_output_delay -clock clk -min 1.000 [get_ports s_axi_arready]逐行说明
- 第 1 行:对写响应信号(bresp, bvalid)设置最大输出延迟 6 ns,最小 1 ns。max 值由主设备要求的 setup 时间决定(示例中主设备 setup 要求 4 ns,周期 10 ns,因此输出延迟 max = 10 – 4 = 6 ns)。
- 第 2 行:对读数据信号(rdata, rresp, rvalid)设置输出延迟。
- 第 3 行:对 ready 信号(awready, wready, arready)设置输出延迟,因为这些信号是从机输出到主设备。
常见坑与排查
- 坑 1:未对 AXI4 的 VALID 和 READY 信号分别约束,导致握手路径时序宽松但实际不满足。排查:检查时序报告中所有 AXI4 信号路径,确保每个信号都有约束。
- 坑 2:输入/输出延迟值设置过于乐观(如 max 值过小),导致综合工具过度优化或时序违例。排查:使用 PCB 走线延迟估算工具(如 HyperLynx)获取实际值,或使用保守值(max = 时钟周期的 60%,min = 时钟周期的 10%)。
- 坑 3:未约束跨时钟域路径(如 AXI4 接口使用异步时钟)。排查:若主从时钟不同,需使用 set_clock_groups -asynchronous 或同步器,并单独约束。
原理与设计说明
AXI4 总线时序约束的核心矛盾在于:主设备与从设备之间的信号延迟必须满足双方的建立/保持时间要求,而 FPGA 内部逻辑延迟与 I/O 引脚延迟共同影响最终时序。为什么需要精确的输入/输出延迟约束?因为工具无法自动知道外部主设备的时序参数(如输出延迟、setup/hold 要求)。set_input_delay 告诉工具信号在时钟沿之后多久到达 FPGA 引脚(用于 setup 分析),以及信号在时钟沿之前多久稳定(用于 hold 分析)。set_output_delay 告诉工具 FPGA 输出信号在时钟沿之后多久必须被外部设备采样(用于 setup 分析),以及输出信号需要保持多久(用于 hold 分析)。
Trade-off 分析:
- 资源 vs Fmax:增加流水线级数(如插入额外 FF)可提升 Fmax,但消耗更多 LUT/FF。对于 AXI4 接口,可在 VALID/READY 路径上插入 1-2 级流水线,代价是增加 1-2 个时钟周期的延迟。
- 吞吐 vs 延迟:AXI4 支持乱序传输,但约束宽松时工具可能插入过多缓冲,增加延迟。建议在约束中明确指定路径组(如 -group [get_paths -to s_axi_rvalid])以优化关键路径。
- 易用性 vs 可移植性:使用 Vivado 的 AXI4 约束模板(Constraints Wizard)可快速生成,但模板值可能过于保守。手动编写约束更灵活,但需理解主设备时序参数。
验证与结果
| 指标 | 约束前 | 约束后 | 测量条件 |
|---|---|---|---|
| Setup Slack (AW通道) | -0.234 ns | +0.567 ns | 100 MHz, Artix-7, 典型工艺 |
| Hold Slack (W通道) | -0.123 ns | +0.234 ns | 同上 |
| Fmax | 85 MHz | 110 MHz | 综合后时序分析 |
| LUT 利用率 | 420 | 450 | 资源报告(含约束优化) |
| FF 利用率 | 580 | 620 | 同上 |
说明:以上数据基于示例工程,实际值因器件、代码与约束值而异。约束后 Fmax 提升约 29%,setup/hold 违例消除。
故障排查(Troubleshooting)
- 现象:Setup 违例集中在 AWADDR 路径。原因:输入延迟 max 值过小。检查点:查看时序报告中 AWADDR 路径的 data path delay。修复:增大 set_input_delay -max 值(如从 5 ns 改为 6 ns)。
- 现象:Hold 违例集中在 WDATA 路径。原因:输入延迟 min 值过大。检查点:检查 hold slack 是否为负。修复:减小 set_input_delay -min 值(如从 1 ns 改为 0.5 ns)。
- 现象:所有 AXI4 路径都违例。原因:时钟周期定义错误(如 10 ns 误写为 20 ns)。检查点:确认 create_clock 的 period 值。修复:更正时钟周期。
- 现象:部分路径未约束。原因:约束遗漏了某些信号。检查点:在时序报告中筛选“Unconstrained paths”。修复:添加缺失的 set_input_delay/set_output_delay。
- 现象:综合后时序通过,实现后违例。原因:布局布线引入额外延迟。检查点:对比综合与实现后的 slack。修复:启用“Physically Aware Synthesis”或添加 set_max_delay 约束。
- 现象:上板后数据错误。原因:功能仿真未覆盖所有握手场景。检查点:添加随机延迟的 AXI4 验证 IP。修复:增加仿真覆盖率,检查 VALID 与 READY 互锁逻辑。
- 现象:Fmax 不达标。原因:组合逻辑过深。检查点:查看关键路径的 logic level。修复:在长路径上插入流水线寄存器。
- 现象:资源利用率过高。原因:AXI4 从机逻辑过于复杂。检查点:检查 mem 深度或状态机。修复:减少寄存器数量或使用 BRAM 替代分布式 RAM。

评论 0