2026年,FPGA工程师面试被问如何用Verilog实现一个支持AXI4-Stream的实时Sobel边缘检测加速器,如何从行缓冲和流水线划分角度设计?

开放10 回答 75 浏览

最近在准备FPGA面试,看到很多公司都问AXI4-Stream接口的加速器设计。Sobel边缘检测是经典题,我想知道具体怎么用Verilog实现行缓冲,比如3×3窗口怎么滑动?流水线怎么划分才能不丢数据?还有AXI4-Stream的握手信号怎么处理?最好能给出代码框架和时序图。

分享:

10 个回答

  • EE专业新生

    行缓冲是实时图像处理的核心,常见做法是用3个FIFO或移位寄存器链来缓存3行数据。以1080p图像为例,每行1920像素,行缓冲深度就是1920,宽度为像素位宽比如8位。输入像素按行流入,第一行填满后开始填第二行,同时第一行数据从缓冲中移出,这样就能在第三个像素到达时拼出3×3窗口。窗口生成可以用3个移位寄存器分别存当前行、上一行、上两行的连续3个像素,每个时钟上升沿滑动一个像素。流水线我习惯分四级:第一级读像素并写入行缓冲,第二级从行缓冲读出三行数据并生成窗口,第三级并行计算Gx和Gy的卷积,第四级计算梯度幅值并输出。AXI4-Stream的握手很简单,valid和ready同时为高时数据才有效,只要在第四级输出前加一个ready信号反压逻辑,比如内部FIFO快满时拉低ready,就能避免数据溢出。代码框架里行缓冲用reg数组实现,注意同步复位和写使能。时序图关键点在于窗口生成后卷积计算可以流水执行,不会因为计算延迟丢数据。

  • 电子爱好者小张

    面试官问这个问题,其实是想看你有没有工程直觉,不只是背代码。行缓冲设计有个陷阱:很多人会用Block RAM做行缓冲,但3×3窗口需要同时读出3个像素,BRAM单端口只能读一个地址,所以必须用双端口BRAM或者3个独立的BRAM分别存三行。更省钱的做法是用移位寄存器链,Xilinx的SRL32原语正好派上用场,一个LUT就能存32位,但要注意深度不够时要级联。流水线划分上,我建议把梯度计算拆成两级:第一级算Gx和Gy的乘加,第二级做绝对值求和或者平方根近似。这样关键路径能压到100MHz以上。AXI4-Stream的valid-ready握手要特别注意死锁:如果你的加速器从AXI-Slave接收数据,又向AXI-Master发送结果,那么输出ready必须独立于输入valid,否则可能互相等待。常见做法是内部加一个双缓冲,输入数据先写入FIFO,处理完再送到输出FIFO,这样输入和输出握手解耦。面试时你画出这个架构图,比写几百行代码更有说服力。

  • 算法学徒

    作为转行自学FPGA的人,我踩过很多坑。行缓冲用FIFO实现最简单,但要注意Verilog里FIFO的读写指针同步问题,异步FIFO跨时钟域处理不好会丢数据。我的做法是用同步FIFO加valid信号,像素时钟和AXI时钟同频就行。3×3窗口滑动时,边缘像素的处理经常被忽略:图像边界没法生成完整窗口,要么补零要么直接丢弃前两行和最后两行。面试时主动提这个点会很加分。流水线我分了五级:读像素、写行缓冲、读行缓冲生成窗口、计算梯度、输出。多一级是为了在窗口生成后加一个寄存器打拍,防止组合逻辑过长。AXI4-Stream的tlast信号也很关键,它标志行结束,可以用来复位窗口计数器。代码框架我建议用状态机控制行缓冲的写入,每收到tlast就换行。时序图可以用visio画,重点标出像素时钟周期内valid和ready的握手时序。面试官一般不会让你手写全部代码,能讲清楚数据流和控制逻辑就够了。

  • Verilog代码新手

    这个问题其实是在考察你对数据流架构和时序收敛的理解,不只是拼凑一个Sobel。先理清一点:行缓冲的本质是把一维像素流重排成二维窗口,用3个深度为图像宽度的FIFO或移位寄存器链就能做到。但要注意,用FIFO实现时,读指针要滞后写指针一个像素周期,否则窗口中心会和当前输入错位。我习惯的做法是:第一个FIFO写满一行后,才开始同时读取第一行并写入第二行,这样三行数据就能并行输出。流水线方面,我建议把梯度计算拆成两段:第一段做Gx和Gy的乘法,第二段做绝对值和比较输出。这样每段组合逻辑深度控制在5级LUT以内,频率能上200MHz。AXI4-Stream的握手要留意一个坑:如果你的加速器有内部FIFO缓存结果,那么输出tready必须由内部FIFO的空满状态决定,而不是直接跟输入tvalid联动。否则输入数据流在反压时可能卡死。代码框架上,我推荐用三段式状态机控制行缓冲写入:IDLE等待tvalid,ACTIVE按像素时钟写入,行尾tlast拉高后切到下一行。时序图可以画三个时钟周期,标出valid、ready和窗口数据对齐的关系。

  • EE新生

    从工程实现的角度,想省资源就别用BRAM做行缓冲,尤其是对高分辨率图像。Sobel的3×3窗口只需要同时读出三行中连续三个像素,用SRL32原语链成移位寄存器是最优解:每个SRL32存32个像素,深度不够时级联即可,1080p需要60个左右,一个LUT就能管一个像素位宽,比BRAM省面积。流水线我推荐分三级:第一级,像素输入并写入行缓冲,同时从缓冲尾部读出三行数据;第二级,用三个8位移位寄存器从三行数据中各自取出连续三个像素,拼成3×3矩阵;第三级,并行计算Gx和Gy的卷积,然后求梯度幅值。注意,梯度计算时不要用平方根,用绝对值之和近似,资源能省一半。AXI4-Stream握手的关键是让输出tvalid在结果准备好时才拉高,并且tready拉低时停止内部处理。常见做法是在第三级输出端加一个深度为4的同步FIFO做缓冲,FIFO空时tvalid拉低,满时反压前级。面试时主动提一句'我用的是shift register而非BRAM来实现行缓冲',面试官会觉得你懂底层资源优化。

  • 硅农幼苗

    我当初自学时被这个问题卡了很久,后来发现关键是理解行缓冲的写入和读出是同时进行的。假设图像宽度是W,你只需要3个深度为W的FIFO。输入像素按行流入,第一行填满第一个FIFO后,第二个FIFO开始写第二行,同时第一个FIFO开始读第一行数据。这样当第三个像素到达时,三个FIFO的读端口能同时输出同一列的上、中、下三个像素。窗口滑动是用3个3深的移位寄存器实现的:每个FIFO读出一个像素后,就喂给对应的移位寄存器,移位寄存器输出三个连续像素,拼成3×3矩阵。流水线我分了四步:第一步,像素输入和行缓冲写入;第二步,从FIFO读像素并更新移位寄存器;第三步,计算Gx和Gy(用9个乘法器和加法树);第四步,输出梯度幅值。AXI4-Stream的valid-ready握手,我是在最后一级输出前加了一个寄存器,当输出tready为低时,寄存器保持当前值不更新,同时拉低上一级的tready来反压。代码框架上,我用一个计数器跟踪当前列位置,当列计数器等于W-1时,说明窗口移动到行尾,下一周期窗口重置。面试官通常会很满意你提到边缘像素的处理:前两行和最后两行以及首尾两列,我直接输出0,这样最简单。

  • FPGA入门生

    如果你是在校生或刚入门,我建议从数据流图反推设计,而不是直接写代码。先画一张像素时钟下的时序图:每一行像素以tlast为结束标记,连续三行输入后,行缓冲的输出端才能同时给出三列数据。具体实现时,我推荐用三个同步FIFO,每个深度为图像宽度,写使能依次轮换:第一个FIFO写第一行时,读使能为低;等第一个FIFO写满,第二个FIFO开始写第二行,同时第一个FIFO开始读第一行;第三个FIFO写第三行时,前两个FIFO都在读。这样第三个像素到达时,三个FIFO的读端口正好对齐到同一列。3×3窗口用三个深度为3的移位寄存器链完成,每个FIFO的读数据喂给对应的移位寄存器,移位寄存器输出三个连续像素,组合成矩阵。流水线我分五级:第一级写FIFO,第二级读FIFO并更新移位寄存器,第三级打拍同步窗口数据,第四级并行计算Gx和Gy的绝对值近似,第五级输出梯度幅值并处理AXI握手。边缘像素的处理:我习惯在行缓冲写入前补零,即每行开头和结尾各加一个像素周期填0,这样边界也能生成3×3窗口,但代价是输出图像尺寸缩小。面试时你可以主动提这个取舍,说明你考虑过实际应用场景。

  • 电路板玩家2023

    作为一个在IP验证岗位干过两年的工程师,我必须提醒你:行缓冲的FIFO深度一定要做成可配置的,用参数传进来,不要写死。因为面试官很可能追问如果你要支持不同分辨率怎么办。Verilog里可以用generate块例化三个FIFO,深度由参数WIDTH决定。3×3窗口滑动时,我倾向于用移位寄存器代替FIFO读端口后的打拍逻辑,因为移位寄存器天然输出连续三个值,省一个时钟周期。具体做法是:每个行缓冲的输出直接连到一个长度为3的移位寄存器,每个时钟沿移位一次,这样窗口矩阵的每一行就是移位寄存器的三个输出。流水线我分三级:第一级,像素输入同时写入三行缓冲(通过写指针轮换)并从缓冲尾部读出三行数据;第二级,用三个移位寄存器从三行数据中取出连续三像素,组合成3×3矩阵,并做一次寄存器打拍;第三级,并行计算Gx、Gy及其绝对值之和,输出梯度。注意,梯度比较阈值可以用一个寄存器配置,这样加速器就能输出二值化边缘图。AXI4-Stream的valid-ready处理有一个常见陷阱:当输出tready拉低时,你的内部流水线不能停,否则输入tvalid会堆积。解决办法是在第三级输出端加一个深度为2的同步FIFO,当FIFO满时,才拉低第二级的握手信号,反压到输入。这样输入数据流只在FIFO满时暂停,不会导致死锁。代码框架里,我建议用状态机控制行缓冲的写使能轮换,每个tlast触发一次行号切换。

  • 数字IC入门

    面试官问这个问题,其实想听的是时序收敛和资源权衡,不是让你背FIFO的写法。我的建议是:行缓冲别用FIFO,用SRL32原语链成移位寄存器,对1080p图像只需要约1920/32=60个SRL32,每个LUT可以管一个像素位宽,资源比BRAM省得多,而且读延迟固定为1个周期,时序容易收敛。3×3窗口的生成不需要额外的移位寄存器,直接取SRL链的三个抽头点即可:比如第0、1、2个位置,每个时钟沿滑出一个新像素,抽头点自动更新。流水线我分两级:第一级,像素输入写入SRL链,同时从三个抽头点读出三行数据,组合成窗口矩阵,并做一次寄存器打拍;第二级,并行计算Gx和Gy的卷积,用加法树实现,不求平方根,用绝对值近似,然后输出。这样关键路径只有加法树,频率能上300MHz。AXI4-Stream的握手,我建议在输出端用寄存器直接驱动tvalid,当内部计算完成且输出tready为高时,tvalid置1;如果tready拉低,tvalid保持直到握手成功。输入端的tready则由内部SRL链的空满状态决定:如果SRL链快满了,就拉低tready,反压上游。这种设计没有内部FIFO,资源最少,但要求输入数据流不能有back-to-back的连续tlast,否则SRL链会溢出。你可以提前跟面试官确认输入流规范,这能体现你的系统级思维。

  • 芯片设计小白

    说实话,这个问题我当年面试也被问过,后来自己实际做项目才发现,关键在于理解行缓冲的写入和读出是同时进行、相互配合的,而不是先后关系。我的做法是这样的:先例化三个深度为图像宽度(比如1920)的同步FIFO作为行缓冲,每个FIFO的写使能通过一个行计数器轮换——第一个FIFO写第一行时,读使能为低;等第一个FIFO写满一行(收到tlast),第二个FIFO开始写第二行,同时第一个FIFO开始读第一行;第三个FIFO写第三行时,前两个FIFO都在读。这样当第三个像素到达时,三个FIFO的读端口正好输出同一列的上、中、下三个像素。然后我用三个深度为3的移位寄存器链,每个FIFO的读出数据喂给对应的移位寄存器,移位寄存器在每个时钟沿滑动一次,输出三个连续像素,组合成3×3矩阵。流水线我分了四级:第一级,像素输入与行缓冲写入;第二级,从FIFO读像素并更新移位寄存器;第三级,并行计算Gx和Gy的卷积(用9个乘法器和加法树,不求平方根,用绝对值近似);第四级,输出梯度幅值并处理AXI4-Stream握手。握手的关键是:在输出端加一个深度为4的同步FIFO做缓冲,当该FIFO非满时,拉高输入tready;当该FIFO非空时,拉高输出tvalid,同时输出tdata和tlast。tlast在每行最后一个像素时拉高,可以通过行计数器判断。这样数据流不会溢出,反压也自然。边缘处理我直接丢弃前两行和最后两行,以及每行前两个和最后两个像素,因为边界窗口不完整。面试时主动提这个点,面试官会觉得你考虑周全。

登录后可在本页底部提交回答

提问者

嵌入式系统新手查看主页
浏览「其他」

描述场景与已尝试方案,更容易获得有效解答

相关问题

同分类

提问建议

  • 标题写清核心疑问,避免「求助」「请问」等空泛用语
  • 正文补充环境、版本、报错信息或截图
  • 先搜索本站是否已有相近问题,减少重复提问
  • 若与课程相关,请标明课时或章节便于讲师定位