正在准备2026年FPGA校招,看到很多面经里提到手撕Verilog实现实时视频处理。我想做直方图均衡化,但累积分布函数的计算在AXI4-Stream流式数据下怎么处理才能不丢帧?是用查找表预存还是流水线实时算?面试官一般会追问哪些边界情况,比如灰度溢出或帧同步丢失怎么处理?求真实面试场景和解题思路。
2026年FPGA校招,手撕Verilog实现AXI4-Stream实时视频直方图均衡化,累积分布函数用查找表还是流水线计算更优?面试官会怎么追问边界情况?
10 个回答

说实话,校招手撕这个题,面试官更想看你有没有工程直觉,而不是背一个标准答案。我的建议是:用查找表预存累积分布函数,因为实时视频流要求每个时钟出一个结果,流水线算CDF即使做pipeline也至少多几拍延迟,而且还要处理帧同步复位。查找表提前算好256个灰度级的累积概率,输入像素灰度直接查表得到映射值,一个周期搞定,不丢帧。面试官追问边界情况,大概率先问灰度溢出:比如输入灰度超过255或者小于0,你要说在AXI4-Stream的tdata上做饱和截位或钳位,同时保证tvalid/tready握手不被打断。帧同步丢失的话,我一般会加一个帧起始标志检测,若连续若干行没收到tlast就复位内部计数器,重新累积直方图。你目前用的是Xilinx还是Intel的器件?LUT资源差挺多的。

这个问题其实反映了校招面试里一个经典矛盾:理论最优 vs 工程可行。从纯算法角度,流水线实时计算CDF确实更精确,因为查找表只能基于上一帧或累积的统计量,但实时视频流要求每个像素在几十纳秒内完成处理,流水线就算拆成三级也得三个时钟周期出结果,而AXI4-Stream是流式握手,一旦你延迟超过一个时钟,就必须用FIFO或反压机制来对齐数据,这会导致帧率下降甚至丢帧。所以实际工程中,绝大多数方案都选查找表,而且不是存一整帧的直方图,而是采用双缓冲:一块BRAM存当前帧的直方图累积结果,另一块BRAM同时接收下一帧的像素计数,帧间切换时把累积表更新一次。这样每个像素只需一次查表,零额外延迟。面试官追问的边界情况,我归纳过三个高频点:第一,全黑或全白帧,CDF是斜率为0的直线,查表输出会丢失对比度,你要说加一个最小增益钳制,比如强制拉伸到[16,235]的TV范围;第二,帧同步丢失导致直方图累积错位,常见做法是用tuser信号携带帧ID,和tdata一起打拍,如果ID不连续就丢弃当前累积结果,重新开始;第三,AXI4-Stream的tready反压场景,如果下游处理单元来不及消费,你的查找表模块必须能暂停查表并保持状态,否则累积表会被错误更新。我个人经验是,准备校招时别光盯着Verilog语法,多想想这些握手协议和时序收敛的取舍,面试官更看重你有没有debug思维,比如写testbench模拟tvalid随机拉低的场景。如果你有时间,可以去GitHub找个开源直方图均衡化IP,对着它的代码改一版双缓冲实现,跑一下仿真,面试时能说出具体资源消耗和延迟数据,比背八股文强很多。

我投查找表一票,但想补充一个容易被忽略的维度:多帧统计的平滑过渡。如果你每帧都重新计算CDF查找表,帧与帧之间亮度突变会让人眼感觉闪烁,尤其监控场景里光照缓慢变化时。面试官可能会追问你怎么处理这个,你可以说加一个帧间IIR滤波器,比如新CDF = 0.9 旧CDF + 0.1 当前帧CDF,这样更新平滑,但代价是响应速度变慢。至于流水线实时计算,其实还有一种折中方案:不计算全256级CDF,而是只算16级bin的直方图,用插值近似CDF,这样流水线深度可以做到2-3级,但精度损失大,面试官一般会反问你怎么保证视频质量。另外,注意AXI4-Stream的tkeep信号,如果数据位宽大于8位(比如24位RGB),每个像素的灰度提取需要对齐字节,边界情况是tkeep不连续时,你的直方图累积模块要跳过无效字节,否则会污染统计结果。我建议你画一个状态机:IDLE等待帧起始,COUNTING模式累积直方图并同时用查找表输出均衡化结果,帧结束后切换双缓冲。面试官如果让你手撕Verilog,大概率会盯着tready和tvalid的握手逻辑写没写对,以及复位时有没有清空查找表。你目前打算用单帧还是多帧累积?这个会影响查找表更新策略。

查找表加双缓冲就够了,流水线算CDF在AXI4-Stream下很容易把时序搞崩,尤其你还要兼顾tready反压。面试官问边界大概率会问全白帧输出崩坏,你说加个最小增益钳位就行。你目前打算用vivado还是quartus?

其实校招面试官问这个,不是真的要你现场写一个工业级模块,而是看你有没有意识到AXI4-Stream的流式特性跟帧级统计天然冲突。我见过挺多人一上来就写流水线算CDF,画个三级pipeline,结果面试官追问tvalid断流时累积器怎么处理、帧同步头在哪拍复位,当场就卡住了。你如果用查找表,真正要准备的不是表怎么建,而是双缓冲切换时那个帧起始标志怎么对齐——很多人的直方图模块在帧间切换瞬间会把下一帧的前几个像素累积到旧表里,导致输出花屏。面试官一般会追问这个点,你答出用tuser信号携带帧同步,在检测到tuser有效时锁存旧表、清零新表,就算过关。另外灰度溢出其实不太会问,因为AXI4-Stream的tdata位宽固定,你截位饱和是基本功;反而他们更爱问BRAM大小:256级灰度用8位深度,每个灰度存20位累积值(假设1080p),一块BRAM18K刚好够,但如果你用36K的块,地址映射要小心高位置零,不然读出来是乱码。你目前项目里直方图均衡化是处理单帧还是视频流?这个区别挺大的。

我个人感觉面试官更想听你提一嘴资源权衡。查找表方案的核心不是表本身,而是你用什么粒度做累积——全帧256级直方图用BRAM很省,但如果你遇到非8位灰度(比如10位RAW图),查表就变1024级,BRAM不够就得用URAM或分布式LUT,这时流式计算反而有优势。你可以说:如果灰度深度≤8位,查找表双缓冲;如果超过10位,改用流水线分两级算累积。面试官会觉得你有工程判断力,不是死记硬背。帧同步丢失的处理我习惯在直方图模块里加一个看门狗计数器,检测到tvalid连续N个时钟没来就复位累积器,比用帧起始标志更鲁棒。

我想从另一个角度聊聊这个问题——不是技术选型,而是你准备手撕时,面试官真正在听的「信号」。很多同学会把精力放在「查找表 vs 流水线」的优劣罗列上,但校招面试官其实更想看到你对「流式数据帧边界」有没有直觉。比如他说「你写一段直方图均衡的Verilog」,你如果在纸上先画出AXI4-Stream的时序图,标出tvalid、tready、tlast、tuser这几根线在帧起始和帧结束时的行为,再解释你的双缓冲切换逻辑——这个动作本身就能让他觉得你有工程思维。我建议你准备时,别只背代码,而是练习在白板上画一个两帧交界处的波形,指着tuser的上升沿说:这里我锁存旧表,同时清零新表的写地址计数器,保证下一帧的第一个像素写入BRAM的地址0。至于查找表和流水线的取舍,我认为在AXI4-Stream下选查找表是安全的,但你要能说出流水线的致命伤:它需要知道整帧的统计量才能开始映射,而流式数据在帧结束前统计量是不完整的,如果你非要流水线,就得用两帧延迟的输出——第一帧统计,第二帧映射,这样实时性就丢了。面试官如果追问「那流水线能不能做帧内分块统计」,你可以说可以,但分块会引入块效应,而且块边界处的tlast处理会非常麻烦。另外,你提到灰度溢出和帧同步丢失,其实还有一个常见的边界:当视频源分辨率变化时,你的帧长度计数器会跟实际tlast个数不匹配,导致累积器复位时机出错。我一般会在模块里加一个可编程的行场长度寄存器,由CPU在初始化时写入,而不是硬编码。你目前手撕时,是用状态机还是计数器来管理帧同步的?这个细节面试官也很爱问。

查表。别纠结。面试官追问边界你就说全黑帧加最小增益钳位,帧同步用tuser复位。流水线实时算在AXI4-Stream下时序很难收,除非你愿意等一帧延迟。

我建议你把重心放在「双缓冲切换的瞬间到底发生了什么」上。很多人的Verilog写出来,仿真时功能正确,但综合后会有问题,原因是在帧结束时刻,你同时要读旧表、写新表、更新累积值,这三个操作如果共用同一个BRAM端口,就会冲突。面试官追问时,你可以说:我让旧表只读、新表只写,切换瞬间用一个小FIFO暂存旧表输出,保证读端口不被打断。这个细节比「查找表还是流水线」更能体现你对BRAM双端口特性的理解。另外,灰度溢出其实不是大问题,因为AXI4-Stream的tdata位宽固定,你截位时用饱和逻辑(大于255就赋255)就行,面试官更想听的是「如果tdata是10位RAW图,你怎么处理」——这时候你要说先做高位截断或映射到8位,再做直方图。你目前用的是10位还是8位数据源?这个会直接影响你的BRAM深度和查表方案。

我是做视频处理IP的,看到这个问题想提醒你一个经常被忽略的细节:面试官追问边界时,很可能会问「当输入分辨率不是标准尺寸时,你的直方图累积器怎么知道一帧结束了?」。很多人默认用tlast作为帧结束标志,但AXI4-Stream规范里tlast是可变长度的,如果上游模块在帧中间因为反压插入了空周期,tlast的位置不会变,但你的写地址计数器可能会因为tvalid握手而多跳几次。所以更好的做法是:用tuser作为帧起始同步信号,在帧内每个有效时钟递增写地址,检测到tuser就复位地址和累积值,而不是依赖tlast。我自己在项目中遇到过tlast被错误拉高导致直方图错位的情况,后来改成tuser+看门狗定时器才稳定。另外,你问查找表还是流水线,我偏向查找表但加一个帧间滤波——不是每帧都更新整个表,而是只更新当前帧统计到的灰度级对应的表项,其他保持不变,这样能减少BRAM的写操作次数,也避免全黑帧导致的突变。你目前是在用Vivado的IP集成器搭系统,还是纯手写RTL?这个会影响你调试时能不能直接用ILA抓直方图波形。
发表回答
登录后可在本页底部提交回答