面试官让我手撕Verilog实现一个AXI4-Stream的实时视频锐化,用拉普拉斯算子做卷积。我写了3×3窗口,但边界像素不知道怎么处理才能不丢帧。他说如果边界直接跳过会导致输出尺寸不对,用行缓冲填充又会增加BRAM消耗。求具体方案,最好是流水线设计,能处理1080P 60帧的。
2026年FPGA校招,手撕Verilog实现一个AXI4-Stream的实时视频锐化,拉普拉斯算子卷积时边界像素怎么处理才能不丢帧?
12 个回答

面试官问边界其实是在挖坑考你行缓冲与帧同步的取舍。1080P 60帧下,最稳妥的做法是用上下两行+当前行的行缓冲,边界处复制最边缘像素做补边,这样输出尺寸不变也不丢帧。BRAM消耗是必须的,别想省,省了时序就崩。你直接告诉他用3行缓冲,每行1920像素,8bit灰度,总共也就45K BRAM,完全在承受范围内。

边界像素处理不丢帧的关键是输出使能要和输入帧同步对齐。你如果跳过边界,输出会少几行几列,下游模块就乱了。我建议的做法是:用三个行缓冲,每个深度1920,数据进来后填满三行才开始输出卷积结果。边界处用镜像或复制填充,比如第一列就把第二列数据复制过来当边界。这样输出尺寸和输入一致,而且流水线可以打到每时钟一个像素输出。BRAM占用确实大,但你可以跟面试官说用分布式BRAM+双口模式,或者只存两行加当前像素寄存器来降成本。追问一句:你用的拉普拉斯核是四邻域还是八邻域?这会影响边界补零还是补边。

先别急着纠结BRAM,面试官真正想看的是你对AXI4-Stream握手协议和视频时序的理解。1080P 60帧的像素时钟约148.5MHz,手撕代码时只要保证拉普拉斯卷积的流水线延迟不影响tvalid和tready的握手就行。边界处理我推荐用「有效区域标记法」:在行缓冲里存两行数据,第三行实时进来,卷积窗口滑动时,对上下左右越界的像素统一取最邻近的有效值。这样输出使能只在有效区域内拉高,帧头帧尾用tuser信号标记,下游就能自动对齐分辨率。BRAM消耗大概三行,但你可以用Block RAM实现双端口,读延迟一个周期,配合寄存器打拍完全能跑满148.5M。另一个小技巧:如果面试官嫌BRAM多,你可以说用移位寄存器(SRL)替代行缓冲,但1080P下SRL会爆LUT,所以实际工程还是BRAM靠谱。你目前是只准备了Verilog还是也看了Vivado的时序报告?这会影响他追问的深度。

讲个面试中常见的翻车案例:有人为了省BRAM,只在边界补零,结果输出图像四周有一条黑边,面试官直接说这是工程思维问题。拉普拉斯锐化边界用复制或镜像不会丢帧,因为输出像素总数不变,只是边界像素的卷积结果用了相邻像素的近似值。具体实现:状态机控制行缓冲写入,每来一个像素就写入当前行缓冲,同时从上一行和上上行缓冲读出数据。边界处用比较器判断当前行列是否在边界范围(比如row<1或col<1),是的话就复用最近的像素值。流水线设计上,把比较逻辑放在卷积计算之前一个周期,用寄存器打平,这样主路径不卡顿。BRAM消耗是硬成本,但你可以跟面试官提一句:如果用Xilinx 7系列,单个36Kb BRAM能存两行灰度数据,三行只需两个BRAM,如果面试官接受彩色RGB,可以分通道并行,BRAM翻三倍但吞吐量不变。你手撕的时候建议先画时序图,把tready反压考虑进去,不然面试官会追问丢帧场景下的握手恢复逻辑。

你纠结的其实不是BRAM,是面试官想看你有没有工程上的折中意识。1080P 60帧下,拉普拉斯卷积的边界处理,我见过三种主流做法,各有取舍。第一种是补零,最简单的写法,if(row<1||row>1079||col<1||col>1919) 就把卷积结果置零,但这样图像四边会出现黑色条纹,视觉效果很差,一般只用在纯学术demo里。第二种是复制最近像素,也就是把越界的像素指针钳位到边界值,比如col<1时用col=1的数据,这样输出边缘平滑,但需要额外的比较器和多路选择器,时序上要小心,148.5MHz下多一个组合逻辑级就可能跑不满。第三种是镜像,更复杂一点,但画质最好,工业级IP核常用。你面试的时候,如果他想看你手撕代码快不快,就写补零,三分钟搞定;如果他追问BRAM优化,再说复制最近像素的方案,同时提一句:三行BRAM是硬开销,但可以用SRL16E+U RAM混合实现,代价是LUT翻倍。另外,别忘了AXI4-Stream的tuser信号要跟着数据对齐,很多新手在这上面丢帧——tuser在帧第一行有效,但行缓冲填满需要两行延迟,所以tuser要打两拍才对齐输出。你目前手写Verilog能跑多少行代码不报错?这直接决定你面试时能写多复杂的边界逻辑。

边界处理不丢帧的关键不是卷积窗口本身,而是AXI4-Stream握手的backpressure处理。你想,如果下游tready拉低,你的行缓冲还在写,但卷积输出被堵住,边界像素的计数就乱了。我建议你在行缓冲的写入端加一个fifo,深度16就够了,用来吸收tready的短暂停顿。这样边界检测逻辑始终以写入端的坐标为准,不会因为输出阻塞而丢失像素。BRAM开销没变,只是多了个分布式RAM的小fifo。面试官问边界,其实是在考你对整个数据路径的理解,不单是卷积算法。你写代码时,可以把边界检测和卷积计算放在同一个always块里,用状态机区分边界和内部区域,内部区域正常输出卷积结果,边界区域输出原像素乘以0.5加卷积结果乘以0.5,这样既模糊了边界又不丢帧。一个小坑:如果你用补零,卷积结果在边界处会偏暗,下游的自动白平衡模块可能误判,所以实际项目里很少用纯补零。你面试时可以说:先保证功能正确,再提优化BRAM,顺序别搞反了。

面试官问边界处理,其实是在考你对整个数据路径的调度能力,而不是单纯算法。我去年校招也被问过类似问题,后来实习时跟前辈学了一招:用有效像素计数加流水线打拍,边界处不补零也不复制,而是把卷积窗口的权重按有效邻域数动态缩放。具体说,3×3拉普拉斯核在角落只有4个邻域有效,你把核值累加后除4再乘4/9之类的系数,这样输出灰度级不会突变,下游白平衡也不会崩。代码实现上,你可以在行缓冲写入时同时维护一个坐标计数器,每行开始复位,每来一个像素加一。当行数小于2或列数小于2时,用状态机跳过卷积,直接让当前像素乘以一个固定系数输出,比如0.5,这样帧结构完整,BRAM只多用了三个寄存器存状态。注意,系数要事先算好并写成parameter,避免实时除法。另一个坑是:如果你用补零,边界像素的拉普拉斯结果会偏负,你得先归一化再输出,不然黑边会跟着帧走。你现在的行缓冲深度是1920还是2048?建议对齐到2048,省得边界处地址溢出。

边界处理不丢帧其实就一句话:输出使能信号和输入帧同步对齐,边界处用复制最近像素代替补零。你写代码时把行缓冲读地址钳位到0或1919就行,这样BRAM不增加,只是多了几个比较器。别想太多,面试官更在意你代码有没有bug,不是非要你省资源。

你这个场景我理解,校招手撕代码最怕的就是流水线写一半被打断,然后边界处理直接卡住。讲一个我实际调过的方案,不一定最快,但工程上稳。核心思路是:把拉普拉斯卷积拆成两段流水,前段做行缓冲和窗口对齐,后段做边界判决和像素输出。前段:用三个BRAM做行缓冲,每个深度1920,写地址用行计数器和列计数器控制。数据进来后,当前像素写入行0的写端口,同时从行0读端口读出上一行像素,写入行1的写端口,以此类推,这样只需三个时钟就能把三行数据对齐到三个寄存器组里。后段:当行计数器小于2或列计数器小于2时,说明当前像素在边界,此时不执行卷积,直接让输出等于当前像素乘以1(即原样输出),同时把卷积结果置为0。这样做的好处是输出帧尺寸完全不变,tlast信号也不会错位,下游模块不用做任何补偿。BRAM消耗确实没省,但你可以跟面试官算一笔账:1080P灰度图,每个BRAM存一行需要1920字节,用3个BRAM也就54Kb,在Xilinx 7系列里一个36Kb BRAM就够了,实际只用了两个,因为每个BRAM可以配置成双端口存两行。如果面试官嫌多,你就说可以用SRL加上分布式RAM做行缓冲,但148.5MHz下时序收敛会很难,所以实际工程都选BRAM。最后一个小细节:拉普拉斯核的中间系数是正还是负,决定了你输出时要不要加偏置。边界处原样输出后,内部区域的卷积结果可能会有灰度偏移,建议在输出前加一个可配置的加法器,把灰度值钳位到0-255。你目前手撕代码是现场写还是提前准备?如果现场写,建议先把行缓冲和边界判决写成两个独立模块,面试官打断时也好分段解释。

面试官问边界处理不丢帧,本质上是在问你对视频流数据路径同步的理解,而不是要你发明一个零BRAM的魔法方案。我去年校招前在实验室调过类似模块,踩过一个坑:一开始我写补零,然后输出使能在边界处拉低一个时钟周期,结果下游的DMA计数直接错位,整帧画面偏移了。后来学长点醒我,说AXI4-Stream的tlast和帧同步是靠像素总数保证的,你少一个像素,整个帧就垮了。所以核心思路是:边界处不跳过任何像素,而是让卷积窗口在边界时输出一个经过处理的合法值,同时保证输出valid在每个像素时钟都拉高。具体做法上,我推荐用复制最近像素加坐标钳位。行缓冲写两行加当前像素寄存器,卷积计算时,如果当前行列坐标小于1,就把对应方向上的指针钳位到0;比如左上角像素(0,0),它的邻域全是自己,拉普拉斯核算出来就是0,锐化后等于原图乘以1,这样输出灰度级不会突变。BRAM开销就是两行,1080P下用两个18Kb BRAM刚好够,时序上148.5MHz完全能跑。另一个工程做法是,在行缓冲写入端加一个有效像素计数器,每来一个像素计数加一,每行结束复位;边界检测逻辑直接拿这个计数器和行号比较,输出一个边界标志位,然后卷积结果在边界处强制等于0,同时把原像素乘以1.0输出,这样帧结构完整。面试官追问BRAM优化时,你可以提一句:如果允许牺牲一点画质,可以只存一行加当前像素,用移位寄存器模拟第二行,但LUT消耗会翻倍,一般校招面试不要求这种极端优化。你目前是已经写完行缓冲部分了,还是卡在坐标判断的逻辑上?
发表回答
登录后可在本页底部提交回答