2026年FPGA校招,手撕Verilog实现AXI4-Stream实时YOLOv8n卷积加速器时,脉动阵列的权重缓冲深度怎么确定?求具体推导和仿真波形

开放9 回答 44 浏览

面试官让我手撕Verilog实现一个基于AXI4-Stream的YOLOv8n卷积加速器,脉动阵列架构,要求DSP利用率90%以上。我卡在权重缓冲深度上,不知道该怎么推导,网上搜到的资料都太理论了。有没有大佬能给出具体推导过程,最好有仿真波形图,让我能直接套用到面试中?另外,AXI4-Stream的tlast和tkeep信号在卷积核滑动时怎么对齐?求详细解答,2026年秋招急用!

分享:

9 个回答

  • 代码小萌新

    兄弟,你这个权重缓冲深度的问题,其实核心是跟你的脉动阵列尺寸和卷积核大小绑定的。推导上,你可以这么想:假设你的脉动阵列是NxN的PE阵列,每个PE一次处理一个乘法累加,YOLOv8n的卷积核是3×3,那权重缓冲至少要能存下N行权重(因为阵列要同时算多个输出通道)。具体深度,你要看数据流的调度方式——常见的是权重驻留(weight stationary),这时候缓冲深度等于卷积核的通道数除以阵列的行数再向上取整,再乘以卷积核的行数。举个例子,如果输入通道是32,阵列行数是16,那缓冲深度就是(32/16)3=6个周期。但面试官要的是90%的DSP利用率,那你得考虑权重加载的流水,别让DSP空等。tlast和tkeep的对齐,简单说,tlast要在卷积核滑动到特征图边界时拉高,比如输入宽度是W,卷积核步长是1,那每W-2个周期来一次tlast(因为3×3核),tkeep则用来标记边界上的有效数据,避免读越界。仿真波形的话,我建议你用Vivado或者Modelsim自己跑个小例子,比如8×8输入+3×3核,把权重缓冲深度设成6或者8,看看tlast和tkeep有没有对齐错误。追问一句:你面试的岗位是偏向算法加速还是通用逻辑设计?这个会影响到他们更看重推导深度还是工程实现细节。

  • 电子技术探索者

    抛开那些花里胡哨的公式,我直接说面试里怎么让面试官点头。权重缓冲深度,本质上是个调度问题,不是算一个固定值就完事的。YOLOv8n的卷积层有多组,每组输入输出通道数不一样,你不可能用一个深度搞定所有层。面试官问这个问题,80%是想看你有没有意识到:深度跟你的片上BRAM资源、外部DDR带宽、以及AXI-Stream的突发传输长度是联动的。常见做法是,你先定一个阵列尺寸,比如16×16,然后算每拍要加载多少权重。如果输入通道是64,那每拍要送64个权重给阵列,假设你的AXI-Stream一次突发能传128个数据(tkeep全为1),那权重缓冲深度至少等于卷积核高度(3)乘以输入通道数除以突发长度再乘以一个安全系数(比如1.5倍,防止AXI延迟)。推导过程你可以这么讲:先假设权重是逐行加载的,每个PE内部存一份权重,那缓冲深度就是卷积核行数乘以输入通道数除以阵列行数。但你要注意,YOLOv8n用了大量1×1卷积,这时候权重缓冲深度可以大大减小,因为一个周期只需要加载1行权重。tlast和tkeep的对齐,你得画个时序图:tvalid和tready握手,tlast在每行特征图最后一个有效数据时拉高,tkeep用来掩掉边界上的无效像素(比如特征图宽度不是偶数时)。面试官要波形,你就说可以在仿真里将tkeep设为0xFFFF(全有效),然后观察tlast的翻转频率是否匹配卷积核滑动的步长。一个常见的坑是,有人把tlast和卷积核的结束信号混淆,导致在滑动窗口边界处丢失数据。我个人建议你准备一个参数化设计的代码框架,把深度设成可配置的,面试时直接说这个深度是根据输入通道和阵列尺寸动态计算的,比背一个固定数字靠谱得多。

  • 嵌入式开发萌新

    权重缓冲深度?直接按阵列行数乘以卷积核高度再除以AXI突发长度,向上取整,加两拍流水。tlast在特征图每行末尾拉高,tkeep全1就行,面试官一般不会细究波形,除非你答不上来。

  • 嵌入式初学者

    你纠结的权重缓冲深度,其实不是算出一个固定数字就完事。面试官要看的推导逻辑是:先定你的脉动阵列尺寸,比如16×16,然后看YOLOv8n的3×3卷积核在权重驻留模式下怎么喂数据。假设输入通道是64,阵列每拍处理一行PE的权重加载,那缓冲深度至少要等于卷积核高度(3)乘以输入通道数除以阵列行数(16),也就是364/16=12拍,再额外加2到3拍流水延迟防止AXI回压。但这里有个关键取舍:如果你把权重缓存做得太深,BRAM占用飙升,FPGA可能布不下;做得太浅,DSP会空等。我建议你先在Vivado里搭个小模块,用AXI-Stream VIP仿真,重点看tready和tvalid握手时权重缓冲会不会欠载。tlast对齐更简单:卷积核每扫完一行特征图输出,tlast就拉高一次,比如输入宽度是320,步长1,那每320个像素输出一个tlast。tkeep全1就行,因为你的数据是连续有效的。追问一句:你目前定的阵列尺寸和时钟频率大概是多少?这俩直接影响深度计算的边界条件。

  • FPGA入门生

    我去年面过类似题目,说下我的推导套路。权重缓冲深度 = ceil(卷积核行数 输入通道数 / 阵列行数) + 流水拍数。比如阵列是8×8,输入通道32,3×3卷积,那8个PE每周期消耗8个权重,32个通道需要4周期送完一行权重,3行就是12周期,再加2拍AXI延迟,深度设14。面试官更在乎你能不能解释为什么这样设计——因为权重驻留模式下,每行PE共用一个权重总线,缓冲就是为了解耦DDR读取和PE计算的节奏。tlast我是在卷积核滑动到特征图最右侧时拉高,用计数器判断当前输出像素的列坐标是否等于width-1。建议你在仿真时故意拉长AXI延迟,看缓冲是否会欠载,这比背公式更能说服面试官。你目前是用Vivado还是Questasim做仿真?不同工具对AXI-Stream握手时序的兼容性有差别,可能影响波形对齐。

  • 数字电路学习者

    你纠结的权重缓冲深度,本质上不是一道算术题,而是一个资源与吞吐的权衡。推导可以分两步:先定阵列尺寸,比如16×16,然后看YOLOv8n的3×3卷积,输入通道64,权重驻留模式下每拍需加载16个权重给一行PE,一行卷积核有64个权重,所以一行要4拍才能送完,三行就是12拍。但面试官更在意的是你能否说明白为什么要加额外缓冲——AXI-Stream的tvalid/tready握手可能有气泡,DDR读取延迟不定,所以深度至少14到16,多出来的2到4拍就是流水气泡吸收区。调试时别只盯着波形,用Vivado的AXI VIP写个自测试,故意在权重加载时拉低tready,观察缓冲是否欠载,这比背公式更能体现工程思维。tlast对齐的话,用计数器判断输出像素的列坐标是否等于width-1,同时tkeep只在最后一行且最后一列时不全为1,其他时候全1。另外,你的脉动阵列是weight stationary还是output stationary?不同数据流对缓冲深度的推导逻辑不一样,后者需要更深的缓冲存部分和。你目前打算用哪个数据流?

  • 数字IC入门者

    个人感觉你被网上那些长篇推导吓到了。面试官问这个,八成是想看你有没有意识到深度跟DSP利用率是联动的。简单说,你设一个深度,然后在仿真里把AXI延迟拉到最大,看DSP空等了多少周期,再反向调深度。tlast对齐更简单:输出feature map每行末尾拉高一次,计数器判断列号等于width-1就行。别纠结波形图,面试官不会让你现场画,能说清推导逻辑就够了。另外,你YOLOv8n是打算用C3还是C2f模块?不同模块的通道数变化会影响权重加载节奏,回答时提一句能加分。

  • 单片机小白

    兄弟,缓冲深度说白了就是看阵列每拍吃多少权重,再留几拍余量扛AXI气泡。你先定PE阵列大小,比如16×16,然后算一行卷积核要几拍才能喂满阵列,深度就设那个数再加2到3拍。别上来就套公式,面试官更想听你讲清楚为什么这么选。

  • 硅农入门

    其实你纠结的权重缓冲深度,在面试里更关键的是「怎么跟面试官讲推导逻辑」,而不是算出精确数字。我去年面过类似题,当时用YOLOv8n的C2f模块举例:输入通道64,阵列8×8,权重驻留模式下每拍消耗8个权重,一行卷积核64个权重,需要8拍送完一行,3行就是24拍。但AXI-Stream可能因为DDR读延迟或tvalid/tready握手气泡导致断流,所以深度至少设到26到28拍,多出来的就是流水气泡吸收区。tlast对齐更简单——你输出feature map时,用计数器判断当前列坐标是否等于width-1,拉高tlast的同时把tkeep设为全1(除非最后一行宽度不是burst对齐)。建议你在Vivado里用AXI VIP搭个自测试,故意把权重加载时的tready拉低几拍,看缓冲会不会欠载,这比背公式更能说服面试官。你目前是用单时钟域还是跨时钟域做DDR读权重?这会影响你缓冲深度的安全系数。

登录后可在本页底部提交回答

提问者

嵌入式小白查看主页
浏览「其他」

描述场景与已尝试方案,更容易获得有效解答

相关问题

同分类

提问建议

  • 标题写清核心疑问,避免「求助」「请问」等空泛用语
  • 正文补充环境、版本、报错信息或截图
  • 先搜索本站是否已有相近问题,减少重复提问
  • 若与课程相关,请标明课时或章节便于讲师定位