面试官让我手写Sobel边缘检测,我写了核心算子,但他说我边界像素处理会导致丢帧。我查了资料,边界像素可以用复制、镜像或填充0,但哪种在硬件里最省资源且不丢帧?还有,流水线设计时,行缓冲深度怎么确定?我用的3×3算子,是缓存两行还是三行?求大佬给个具体的Verilog代码框架,最好能直接套用,急!
2026年,FPGA校招面试官让我手撕Verilog实现一个AXI4-Stream的实时Sobel边缘检测,边界像素怎么处理才能不丢帧?求具体代码框架
11 个回答

面试官问边界像素处理,其实核心不是选哪种padding方案,而是你理解没理解AXI4-Stream的帧同步机制。你写核心算子的时候,如果边界像素直接跳过去不输出,那输出帧的时序就断了,data_valid会出缺口,下游模块拿到的是残缺帧。复制、镜像、填0在资源上差别不大——3×3算子,边界只用多寄存一个像素值和两行line buffer,多花几十个LUT和几个BRAM而已。真正容易丢帧的地方在于:当你处理第一行和最后一行时,行缓冲还没填满或已经清空,你如果硬输出,那输出帧的像素总数就不对。常见的做法是:先让行缓冲跑起来,等第三行数据进来才开始输出有效像素,这样前两行边界自然被截掉;或者你用状态机控制,在帧起始和结束各插入两行/两列的无效像素(比如填0),但这样要调整输出计数器。我个人建议用第一种,省逻辑。行缓冲深度就是一行像素数,3×3算子缓存两行就够了——当前行从输入进来,line0存上一行,line1存上上行,三个像素从line1、line0和当前输入同时取。代码框架你可以搜开源项目里的sobel_axis_top,注意把axis_tready和axis_tvalid的握手逻辑写对,别在边界处拉低tready导致上游反压丢数。你目前用的是哪个开发板或仿真工具?不同工具对BRAM推断有差异,可能会影响行缓冲的实现方式。

边界像素不丢帧,关键不在padding选啥,而在你行缓冲的启动时刻。你等第三行数据来了再开始输出,前两行自然就不需要特殊处理了。镜像和复制多耗寄存器,填0最简单。代码框架别指望直接套,面试官要看你有没有理解流水线握手,不是抄个sobel模块。

你这个问题其实暴露了很多人准备FPGA校招面试时的通病:太关注算法细节,忽略了接口时序的完整性。Sobel边缘检测本身很简单,3×3算子加两个加法器一个比较器就出来了,但面试官要考察的是你能否在AXI4-Stream这种流式接口下,把图像处理做成一个无背压、无丢帧的流水线。你提到的边界像素处理,如果只从算法角度想,复制、镜像、填0在资源上确实差不多——填0最简单,因为寄存器初始化就是0,边界处直接把缺失的像素赋0就行。但面试官说你会丢帧,我猜问题出在:你处理边界时,是不是在输出端做了类似if (row==0 || col==0) skip; 的逻辑?这样一跳过,tvalid就断了一拍,但上游的tready还在拉高,数据继续往前推,等你再拉高tvalid时,像素序号已经对不上了,下游拿到的帧就缺像素。正确的做法是:不要让输出端跳过任何时钟周期,边界像素照常输出(填0也好,复制也罢),但保证每个时钟周期tvalid都有效,直到帧结束。这样帧率就不会掉。行缓冲深度,3×3算子缓存两行就够了,第三行从输入实时取。代码框架我建议你分三个always块:一个写行缓冲(用BRAM或shift register),一个做3×3窗口滑动(用三个寄存器组),一个做梯度计算和阈值比较。关键是把窗口滑动的使能信号和axis_tvalid对齐:只有tvalid为高且tready为高时,窗口才滑动,行缓冲才更新。这样握手逻辑就和数据处理绑在一起了。另外,面试官可能会追问边界处的梯度值怎么算——比如左上角像素,周围只有3个像素有效,你怎么算Gx和Gy?你可以说:把缺失的像素补0,这样梯度值会偏小,但边缘检测的响应在边界处自然衰减,不影响内部区域的检测。如果面试官要求精确,那就用镜像,但镜像需要额外一行一列的缓存,资源翻倍。你现在的行缓冲是用BRAM还是分布式RAM实现的?如果是BRAM,要注意读延迟和写使能的时序对齐,否则边界处的数据会错位。建议你先在仿真里把tvalid和tready的波形拉出来,看每个像素的序号是否连续,再决定padding方案。你目前是准备用Vivado还是Quartus?不同工具对BRAM的推断规则不同,可能会影响行缓冲的初始化行为。

丢帧的根因不在边界选复制还是填0,而在你输出像素的节拍跟上游tvalid/tready的握手错位了。很多校招同学写Sobel时,习惯把边界像素单独拎出来处理:if (row==0 || col==0) 就直接让输出valid拉低一拍,以为这样能跳过无效数据。但AXI4-Stream是流式协议,你这一拍valid拉低,上游如果tready一直为高,它会把下一拍的数据推过来,等你再拉高valid时,你的输出数据跟下游期望的像素位置已经错开了一个周期,累积到最后帧尾就缺了一个像素,这就是丢帧。正确的做法是:不要在输出端做条件跳转,而是在行缓冲层面解决边界。3×3算子需要缓存两行数据,因为当前行加上前两行刚好凑够三行。你可以用一个双口RAM或者移位寄存器链做line buffer,等第三行数据进来后再开始输出有效结果。前两行数据进来时,输出valid保持低电平,但行缓冲照常更新,这样边界像素自然被忽略,不会打乱输出节奏。至于填充方案,填0最省资源,因为寄存器复位就是0,不需要额外逻辑去复制边界值。真正需要小心的是你line buffer的地址指针和帧同步信号tlast的生成,tlast必须在最后一个有效像素输出时拉高,不能早也不能晚。如果你用计数器控制输出像素总数,记得把边界跳过的像素从总数里扣掉。代码框架建议这样写:一个状态机控制行缓冲写入和读出,一个计数器记录当前行号,一个计数器记录当前列号。行缓冲深度等于图像宽度,宽度参数化。当行号>=2且列号>=2时,才开始从行缓冲和当前像素中取3×3窗口做Sobel运算,同时拉高tvalid。这样写出来面试官一眼就能看出你理解了流水线握手和帧同步。追问一句:你用的图像宽度是可参数化的吗?还是固定值?这会影响你line buffer是用BRAM还是寄存器链。

行缓冲深度是两行,不是三行。3×3算子需要三行数据同时参与运算,但当前行数据是实时进来的,所以你只需要缓存前两行。具体实现:用两个深度为图像宽度的FIFO或者移位寄存器链串起来,数据先进入第一行缓冲,第一行缓冲的输出再进入第二行缓冲。当第三行数据到达时,第一行缓冲里存的是上行数据,第二行缓冲里存的是上上行数据,三者对齐就能开始算。边界像素不丢帧的关键是:在前两行数据流入期间,输出tvalid必须保持低电平,等第三行数据有效后才拉高。这样前两行的边界像素根本不会被输出,下游拿到的帧自然不缺像素。填0方案最简单,因为你只需要复位时寄存器为0,不需要额外逻辑去镜像或复制。代码里注意把tlast信号的生成逻辑跟像素计数器绑定,计数器范围设为(图像高度-2)(图像宽度-2),而不是整帧像素数。顺便问一下,你的面试官有没有追问tready反压时的处理?如果下游拉低tready,你行缓冲里的数据会被覆盖吗?

先明确一点:行缓冲深度是两行,不是三行。很多人一听3×3算子就下意识以为要缓存三行,其实当前行是实时流入的,你只需要把前两行存下来。具体做法是用两个深度为图像宽度的FIFO或者移位寄存器链串起来,数据进来先写进第一行缓冲,第一行缓冲的输出再喂给第二行缓冲。当第三行数据到达时,第一行缓冲里存的是上一行,第二行缓冲里存的是上上行,三行数据就对齐了。这时候才开始输出有效像素,前两行数据在流入期间,你的输出tvalid必须拉低,下游自然拿不到那些边界像素,也就不会丢帧。至于边界列的处理,你只需要在每行数据流开始和结束的两拍,把缺失的像素填0就行——因为寄存器复位就是0,不需要额外逻辑。但这里有个容易翻车的细节:你的tlast信号不能简单地等于像素计数器计到行尾,而要绑定到输出有效像素的计数器上。比如图像宽720高576,你输出有效像素的范围应该是(行号从2到575, 列号从2到719),所以tlast应该在输出计数器等于719-2=717时拉高,而不是在原始像素的719处。这样下游拿到的帧自然就少了边界两行两列,但帧内像素完整。面试官真正想看的不是你写不写得出Sobel算子,而是你能否在流式接口下把行缓冲启动时序、输出valid控制、行末信号生成这三个点串起来。你现在的代码是不是直接在输出端做了if (row==0 || col==0)这种条件跳转?那样valid断一拍,后面所有像素都错位,最后帧尾就缺了一个像素。方便的话可以说说你现在用的图像分辨率是多少,这样行缓冲的深度参数能定得更准。

面试官说你会丢帧,大概率不是边界选复制还是填零的问题,而是你输出valid的控制逻辑没做对。3×3算子需要两行缓冲,当前行实时进来,前两行分别存在两个深度为图像宽度的FIFO里。重点在于:在第三行数据到达之前,你的输出tvalid必须一直为低,这样前两行的像素根本不会被下游收走。等到第三行数据进来,三行对齐了再开始拉高valid输出有效结果。这样前两行和最后两行的边界自然就被截掉了,不需要额外处理。边界列同理,每行开头两拍和末尾两拍,你只需要把缺失的像素用0填充进算子窗口就行,因为寄存器复位就是0,不耗逻辑。但注意,你的行末tlast信号要跟着输出有效像素计数走,而不是跟着原始像素计数走,否则下游帧长会多出几拍。你现在的代码里tlast是怎么生成的?如果直接绑到原始像素行尾计数器上,那丢帧就是这里出的问题。

面试官说你会丢帧,大概率不是复制还是填0的问题,而是你输出valid的控制逻辑没做对。3×3算子需要两行缓冲,当前行实时进来,前两行分别存在两个深度为图像宽度的FIFO里。重点在于:在第三行数据到达之前,你的输出tvalid必须一直为低,这样前两行的像素根本不会被下游收走。等到第三行数据进来,三行对齐了再开始拉高valid输出有效结果。这样前两行和最后两行的边界自然就被截掉了,不需要额外处理。边界列同理,每行开头两拍和末尾两拍,你只需要把缺失的像素用0填充进算子窗口就行,因为寄存器复位就是0,不耗逻辑。但注意,你的行末tlast信号要跟着输出有效像素计数走,而不是跟着原始像素计数走,否则下游帧长会多出几拍。你现在的代码里tlast是怎么生成的?如果直接绑到原始像素行尾计数器上,那丢帧就是这里出的问题。

其实面试官想看你有没有理解流式接口的帧同步,不是真的纠结边界像素怎么填。你如果写一个if(row==0)跳过边界直接输出,那valid断了一拍,上游数据会继续推进,累积到最后帧就缺像素。正确做法:行缓冲用两个深度为图像宽度的FIFO串起来,等第三行数据进来后才开始输出有效像素,边界列同理,每行开头两拍和结尾两拍用0填充(寄存器默认0),tlast绑定到输出有效像素的计数器上。这样代码逻辑很干净,也不丢帧。你手头有具体图像分辨率参数吗?不同行宽会影响FIFO深度选型,这个得先确认。

面试官说你会丢帧,其实根子不在边界填什么值,而在你行缓冲的启动时序。3×3算子只需要缓存两行——当前行实时进来,前两行分别存在两个深度为图像宽度的FIFO里。关键操作:在第三行数据到达之前,输出tvalid必须一直为低,这样前两行的边界像素根本不会被下游收走。等第三行数据进来后,三行对齐再开始拉高valid输出有效结果。边界列的处理更简单:每行开头两拍和末尾两拍,缺失的像素直接用0填充——寄存器复位就是0,不耗任何逻辑。你现在的代码里tlast是怎么生成的?如果直接绑到原始像素行尾计数器上,那下游帧长会多出几拍,这才是丢帧的真因。
发表回答
登录后可在本页底部提交回答