面试时被问到用Verilog实现AXI4-Stream实时视频裁剪,要求支持任意起始坐标和尺寸。我卡在边界处理上,比如裁剪区域超出原始图像时是补黑边还是直接丢弃?流水线怎么设计才能保证不丢帧?求大神指点具体实现思路和代码框架,最好能给出边界判断的状态机设计。
2026年FPGA校招,手撕Verilog实现AXI4-Stream实时视频裁剪,面试官问边界处理怎么设计才能不丢数据?
8 个回答

边界处理的核心是提前算好有效像素区间,我自己的做法是在行场同步信号的基础上加一组坐标计数器,每来一个像素就用当前行列坐标跟裁剪窗口的起始和结束比较,在有效区间内才让 data_valid 拉高。超出区间的时候保持 tready 为高但不采样数据,这样流水线就不会 stall,也不丢帧。状态机其实不用太复杂,两状态就行:IDLE 等帧起始,ACTIVE 等行列计数到裁剪窗口结束再跳回 IDLE。关键点是把坐标比较逻辑做成组合逻辑打进流水线,别让判断成为关键路径。如果你担心裁剪区域超出原始图像,可以在初始化时做一次坐标钳位,把起始坐标限制在图像范围内,这样补黑边或丢弃都不用临时判断。

先说你最关心的丢帧问题。AXI4-Stream 本质是握手机制,只要你的下游模块 tready 没拉低,数据就不会丢。设计时把裁剪模块当成一个简单的坐标过滤器,每个像素进来先做行列计数,然后判断该像素是否落在裁剪窗口内。落在窗口内就原样传出去,落在窗口外就把 tdata 置零或者直接不给 tvalid,但要注意 tready 必须照常接收,否则上游 stall 会反压到前级。边界超出图像的情况,我建议补黑边而不是丢弃,因为很多视频处理链路要求输出帧尺寸固定,你如果丢弃那几行像素,下游的 scaler 或 encoder 可能直接崩掉。具体实现时可以在参数里配一个 max_width 和 max_height,初始化时把用户给的裁剪坐标跟这个最大值做比较,超出部分用零填充。状态机我见过有人写五状态,其实没必要,两状态加两个计数器就够了。状态 A 等待帧头,状态 B 处理行像素,每行结束检查行计数是否到了裁剪窗口底边,到了就回状态 A。额外注意一下行场同步的延迟对齐,数据路径上加一级流水寄存器,保证 tvalid、tdata、tlast 和 tuser 同步。你现在的项目里有没有用到具体的视频分辨率?如果分辨率不大,完全可以用纯组合逻辑做坐标判断,省掉状态机。

我自己的做法是行场同步计数器加组合比较,不用状态机也能搞定。每来一个像素,当前行列坐标如果在裁剪窗口内就给 tvalid,否则 tdata 置零但 tready 必须始终拉高——上游只要看到 tready 为高,就不会 stall 整个流水线,所以数据不会丢。边界超出图像时,我建议初始化时就把用户给的坐标 clamp 到 [0, max_width-1] 和 [0, max_height-1] 范围内,这样裁剪窗口自动限制在有效区域内,补黑边的操作就变成对 clamp 后窗口外的像素输出零值。你更关心的是面试官考你状态机还是考你握手反压?

面试官问边界处理,其实有两层考察:第一层是你能不能把 AXI4-Stream 的握手协议讲清楚——tvalid 和 tready 的依赖关系,以及当裁剪窗口外像素进来时,你的模块必须依然给出 tready 高电平,否则上游会被堵死导致整帧卡住。第二层才是边界超出图像时的策略选择。我个人建议在面试中优先选「补黑边」而不是「丢弃」,因为很多视频 IP 链(比如 VDMA 接 scaler 再接 encoder)要求每帧行数列数严格固定,你如果直接丢掉超出行,下游帧同步就乱了。实现时可以用两个参数记录图像的最大宽高,在配置阶段把用户给的起始坐标和尺寸做一次饱和处理,比如起始 col 大于 max_width-1 就直接赋值 max_width-1,这样后面流水线里就不用每拍都做比较。如果面试官接着问状态机,你告诉他两状态足够:IDLE 等第一个像素的 tvalid,然后进入 ACTIVE 直到行场同步结束。顺便提一嘴,如果面试官追问「补黑边时 tdata 怎么赋零值」,你可以说用组合逻辑判断当前行列是否在窗口内,不在就把 tdata 全拉低,同时 tkeep 按需处理——这样既省逻辑又不会让关键路径变长。你目前是在准备手撕代码还是已经进入了综合面?追问一句能帮你把回答调得更对症。

补黑边还是丢弃,其实取决于下游模块对帧尺寸的要求。很多视频链路(比如接VDMA或Scaler)要求每帧行数列数严格固定,你如果直接丢弃超出部分,下游帧同步计数器会乱掉,导致整帧错位。所以我建议优先选补黑边,实现时在初始化阶段把用户给的起始坐标和尺寸做一次饱和处理——比如起始行大于max_height-1就直接赋max_height-1,这样流水线里每拍只用判断当前行列是否在窗口内,不需要额外做边界比较。状态机两状态足够:IDLE等帧起始,ACTIVE内做坐标匹配,走到窗口结束行尾再跳回IDLE。你目前是用哪个厂家平台在仿真?不同工具对Xilinx原语的支持有差异。

边界处理的核心是保证上游不反压。AXI4-Stream规定tvalid和tready握手成功才算一拍传输完成,如果你的模块在裁剪区外把tvalid拉低却不收数据,上游的tready会因为没收到valid而一直等待,最终导致整帧卡死。所以关键原则:tready必须始终为高,流水线不能串行等待。具体做法是行列计数器独立跑,每个时钟周期判断当前坐标是否在裁剪窗口内,在窗口内才把tdata和tvalid传给下游,窗口外则给tdata置零、tvalid拉高——这样下游收到但标记为无效像素,不会破坏帧格式。边界超出图像时,我建议在配置寄存器里加一对钳位参数,把用户给的起始坐标限制在图像最大范围内,这样裁剪窗口自动落在有效区域,补黑边就变成对钳位后窗口外的像素输出零值。状态机我见过有人写四五个状态,其实大可不必,用计数器加组合逻辑就够。你更关心的是面试官考你代码风格,还是考你握手协议的时序细节?

说实话,这个题面试官真正想看的不是你背没背过裁剪模块的代码,而是你对AXI4-Stream握手反压机制的理解深度。很多应届生上来就写状态机,把边界判断和像素传输混在一个状态里,结果tready被条件分支卡住了——这是最典型的丢帧原因。正确的做法是把握手协议当成数据流的基础设施,tready永远跟随上游的valid做流水线拍数对齐,不要和业务逻辑的坐标判断耦合。比如你可以用两级寄存器做握手桥接:第一级寄存上游的tdata和tvalid,第二级根据行列坐标选择是否让数据通过。坐标判断做成纯组合逻辑,只影响第二级寄存器的使能信号,不参与第一级的握手。边界超出图像时,我推荐补黑边方案,但实现细节上注意别用乘法器——起始坐标和窗口尺寸都是可变参数,你如果用乘加器去算每个像素的地址偏移,关键路径时序会很难看。更好的做法是在帧同步信号到来时预计算好窗口的行起始、列起始、行结束、列结束四个边界值,存在寄存器里,每拍像素进来用加减比较器做边界判断。面试官如果接着问你流水线深度怎么定,你可以告诉他一般设两级:一级用于边界判断,一级用于输出tdata/tvalid对齐,这样时序和面积都比较平衡。你目前在做仿真时,时钟频率大概多少?如果是100MHz以上,建议把组合比较逻辑拆成两拍流水,否则setup time容易出问题。

说实话,面试官问边界处理,其实是想看你有没有真正理解AXI4-Stream的握手反压机制,而不是单纯背状态机模板。很多同学一上来就写两状态机,状态切换逻辑里混着tready和tvalid的赋值,结果一仿真就发现:当裁剪窗口外像素进来时,tvalid被拉低了,但tready因为某种组合逻辑依赖也被拉低,上游的源端收不到tready为高就会一直等,整条流水线就卡死了,帧尾永远到不了。
我建议你换个思路:把裁剪模块当成一个纯组合逻辑的坐标过滤器,握手机制单独抽出来做。具体来说,用两级流水线:第一级寄存上游的tdata和tvalid,tready永远跟这一级打紧,不要被后级坐标判断影响;第二级根据当前行列坐标是否在窗口内来决定是否让数据通过,坐标判断做成纯组合逻辑,只控制第二级寄存器的写使能或输出mux。这样第一级的tready永远是高(除非下游反压),上游数据就能一直流进来,你只需要在第二级里决定传原数据还是传零。
边界超出图像时,补黑边比丢弃好,因为下游模块(比如接VDMA或HDMI输出)通常要求每帧行数和列数严格固定,你如果直接丢掉超出行,帧同步计数器就乱了,整帧会错位。补黑边的实现也很简单:在配置寄存器里加一对饱和钳位逻辑,把用户给的起始坐标限制在[0, max_width-1]和[0, max_height-1]范围内,裁剪窗口尺寸也做同样的钳位。这样流水线里每拍只需要比较当前坐标是否在钳位后的窗口内,不需要额外做边界越界判断,时序更干净。
状态机其实可以简化到零状态——用行场同步计数器加组合比较就够了。你目前在仿真时是用Vivado还是Modelsim?不同工具对Xilinx原语的综合行为有细微差异,我遇到过Modelsim里tready被优化掉的情况,可以提前跟你说一下排查方法。
发表回答
登录后可在本页底部提交回答