今年秋招准备FPGA岗位,面试官让我手撕Verilog实现一个基于AXI4-Stream的实时Sobel边缘检测。我大概知道要用行缓冲存3行数据,但3×3卷积核的流水线具体怎么设计才能保证4K60帧不丢帧?比如行缓冲深度是不是至少需要1920?边界像素怎么处理?求大佬给个具体的设计思路和关键代码片段,面试官问得特别细,怕答不上来。
2026年FPGA秋招,面试官问Verilog实现一个基于AXI4-Stream的实时Sobel边缘检测,3x3卷积核的流水线怎么设计才能不丢帧?
10 个回答

先确认一下,你用的FPGA平台有没有内置的Line Buffer IP?很多Xilinx的片子直接例化个FIFO做行缓冲就能省不少事。至于丢帧,关键是把Sobel的3×3窗口计算拆成三级流水:第一级读像素进缓存、第二级做卷积乘法、第三级累加输出,每拍都能进一个新像素就不会断流。边界像素直接补0或者复制边缘值,面试官更在意你能说清为什么选补0而不是别的方案。

个人感觉面试官最想听的是你对AXI4-Stream握手机制的理解,而不是纯写Verilog。你要先画出时序图:tvalid和tready握手时,你的行缓冲怎么在tvalid拉高时保证输出有效数据?如果前一帧还没处理完下一帧tvalid就来了,你怎么防止丢帧?建议在Sobel模块入口加一个深度为4的异步FIFO做弹性缓冲,把AXI4-Stream的背压和内部流水线解耦。行缓冲深度确实至少1920,但如果你用Block RAM做双端口读,每行存完最后一列马上开始读下一行,其实只要2行半的存储就能跑起来,不过代码写起来会绕一点。边界像素处理我见过面试官追问:你补0之后边缘的梯度值会偏小,有没有想过用镜像填充?这个点一提就能拉开差距。

关于4K60帧不丢帧这件事,你得先算带宽:4096x2160x60x每个像素8bit,大概4Gbps,而AXI4-Stream通常跑150-200MHz,数据位宽32或64位,带宽是够的。但流水线设计里最容易翻车的地方是行缓冲的写地址控制和Sobel窗口的移位逻辑。我建议你把行缓冲做成3个独立的双口BRAM,每个深度1920,写地址用一个计数器循环,读地址比写地址滞后2个时钟周期——这样你永远能读到当前行、上一行、上两行的同一列数据。这样设计的好处是窗口滑动时不用频繁搬数据,每个时钟周期只需要从3个BRAM各读一个像素,然后在下一拍做乘加。对了,边界处理别用if-else判断像素坐标,那样会引入组合逻辑延迟,正确做法是在行缓冲初始化时把第一行数据复制一遍,或者用地址饱和截断。代码片段的话,你可以在网上搜一个叫'sobel_line_buffer'的开源项目,但面试时最好手写一个简化版:三个reg [7:0]数组加三个移位寄存器,面试官看你连循环展开都手写出来,基本就过了。追问一句:你准备用组合逻辑还是时序逻辑做卷积加法?面试官十有八九会问这个问题,因为组合逻辑容易产生毛刺,时序逻辑又得多打一拍。你当前打算怎么选?

其实面试官问4K60帧不丢帧,核心就一个点:你的流水线能不能每个时钟周期都吞进一个新像素并吐出一个新梯度。别想着在Sobel窗口里搞什么复杂状态机,三级流水最稳:第一拍读行缓冲的3个像素,第二拍做Gx和Gy的乘加,第三拍算幅值并输出。行缓冲深度1920没错,但你要是用Xilinx的FIFO做行缓冲,注意把Almost Empty标志用上,提前拉高读使能,不然读地址追不上写地址就会断流。边界补0最简单,面试官追问的话你就说补0等效于对图像边缘做零填充,不会引入额外的数据依赖,流水线不用停。你用的FPGA是哪家的?不同的IP配置差别还挺大的。

我建议你先别急着写代码,把AXI4-Stream的backpressure和Sobel流水线的耦合想清楚。面试官真正想听的不是你会例化BRAM,而是你怎么在tvalid/tready握手时保证数据流不中断。常见的坑是:行缓冲写满了,但上一帧的梯度还没输出完,下一帧的tvalid就来了,这时候你只能拉低tready丢帧。解法是在Sobel模块入口放一个深度为16的异步FIFO做速率匹配,这样即使内部流水线偶尔 stall,FIFO也能吸收几行的数据抖动。行缓冲用3个双口BRAM,每个深度1920,写地址统一用一个计数器循环,读地址比写地址滞后2拍,这样窗口滑动自然对齐。边界处理别写if-else判断坐标,那会引入组合逻辑链,正确做法是把行缓冲的读地址在边界处做饱和截断——比如地址小于0就固定读第0列,大于1919就读第1919列,这样BRAM的读操作永远是连续的,时序更好收敛。代码的话,你可以在网上搜一个叫`line_buffer_saturate`的开源模块,直接改端口适配AXI-Stream就行。另外,Sobel的Gx和Gy卷积其实可以复用乘法器,先算Gx再算Gy,两个结果用同一个DSP slice分时复用,能省一半资源,不过面试时主动提这个点会让面试官觉得你考虑过面积优化。你目前代码写到什么程度了?是卡在行缓冲的地址控制还是输出时序?

补充一个容易被忽略的点:4K60帧下像素时钟大概600MHz左右,但FPGA通常跑不到那么高,所以AXI4-Stream的数据位宽必须做宽。比如你用64位位宽,一个时钟传两个像素,那么行缓冲的BRAM深度只需要960,但Sobel窗口的移位逻辑要改成每次读两个像素进来,然后做两次卷积计算。面试官如果问你带宽计算,你得当场把公式推出来:像素时钟=4096216060≈530MHz,用200MHz主频的话数据位宽至少需要64位才能满足。边界像素我建议用镜像填充,因为补0会让边缘梯度值偏小,导致边缘检测结果在图像四周有一条黑边,面试官看到你考虑到了应用效果会很加分。实现时把行缓冲的地址截断改成镜像映射就行了,比如读地址addr=0时实际读BRAM的addr=1,addr=1时读addr=0,这样边缘像素的梯度值和内部一致。不过镜像填充会增加一点组合逻辑延迟,你要在时序约束里把这条路径单独设宽松一点。你板子上有没有多余的DSP切片?Sobel的乘法用LUT拼的话时序容易崩。

我注意到你反复提到4K60帧,这个数据率在面试里确实是核心考点,但很多人一开始就把自己绕进BRAM深度计算里去了。面试官其实更想听你怎么处理数据流的连续性,而不是单纯背出1920这个数字。我建议你换个思路:先画一个三级流水线的时序图,标清楚每一拍数据怎么流动——第一拍从AXI4-Stream接收像素并写入行缓冲,第二拍从三个行缓冲里同时读出当前窗口的3×3数据,第三拍做Gx和Gy的乘加并输出梯度。行缓冲深度确实至少1920,但如果你用双口BRAM,读地址比写地址滞后两拍,窗口自然对齐,不需要额外状态机。边界像素我推荐用镜像填充,因为补0会导致边缘梯度值偏小,面试官如果追问应用效果,你可以举个具体例子:比如在医学图像里,边缘的黑边可能会被误判为病灶边界。另外有一个常见坑:行缓冲写满后如果下一帧tvalid提前到来,你得在Sobel模块入口加一个深度16的异步FIFO做弹性缓冲,不然直接拉低tready会丢帧。代码片段不用背整段,能现场推一下数据位宽公式就够了:像素时钟约530MHz,主频200MHz时位宽至少64位。你当前用的FPGA是Xilinx还是国产的?不同厂家的IP配置差别挺大,会影响FIFO的具体实现方式。

我觉得你现在的焦虑点有点偏了——面试官让你手撕Verilog,但真正拉开差距的不是你能默写出行缓冲的代码,而是你能不能解释清楚为什么这么设计能保证不丢帧。我建议你把准备思路分成三层:第一层是数学基础,你得当场推算出4K60帧的像素时钟频率,然后根据你的主频反推出数据位宽,这个公式面试官很喜欢现场考;第二层是架构取舍,行缓冲用三个独立的双口BRAM还是用一个FIFO加乒乓操作,这两种方案在资源消耗和时序收敛上各有优劣,比如用BRAM直接映射地址的话,镜像填充只需要在边界处把读地址做饱和截断或取反,比写if-else判断坐标要干净得多,组合逻辑链也短;第三层是异常处理,比如AXI4-Stream的tuser信号怎么用来同步帧起始,如果上一帧还没处理完下一帧的tvalid就来了,你的流水线能不能自动清空内部状态而不丢数据。面试官往往不会让你写完整代码,而是让你画流水线结构图然后口述关键信号时序。你可以在纸上画一下行缓冲的写地址计数器和读地址计数器之间的相位关系,如果能说清楚为什么读地址总是比写地址滞后两拍,以及边界地址怎么截断,基本就能过关了。另外我个人建议,面试前别光看Sobel这一个模块,顺便把高斯滤波的流水线结构也看看,因为很多面试官会接着问你怎么把两个模块级联起来,这时就要考虑AXI4-Stream的ready信号怎么跨模块传递了。你目前是在校生还是已经工作一段时间了?如果是校招,面试官更看重你的推导过程而不是最终代码,别怕现场推公式慢,但一定要把每一步的逻辑说清楚。

其实面试官问4K60帧不丢帧,背后的潜台词是:你能不能把数据流和计算流之间的时序关系理清楚。行缓冲深度1920确实是常见的做法,但如果你只用单口BRAM,写地址和读地址共用一个端口,那每个时钟周期只能读或写,流水线必然断一拍。正确做法是用双口BRAM,一个端口专门写,另一个端口专门读,读地址比写地址滞后两拍,这样窗口数据在每个时钟周期都能对齐。边界像素我推荐镜像填充,因为补0会让边缘梯度值偏小,在医学图像或工业检测里这个偏差会被放大。实现时不需要写复杂的if-else,而是把行缓冲的读地址在边界处做饱和截断:比如地址小于0时取0,大于1919时取1919,这样组合逻辑链更短。另外有个常见的坑:AXI4-Stream的tvalid和tready握手时,如果上一帧的梯度还没输出完,下一帧的tvalid就来了,你的模块得能自动清空内部状态而不丢数据。解法是在Sobel模块入口加一个小深度的异步FIFO做速率匹配,比如深度16,这样即使内部流水线偶尔stall,FIFO也能吸收几行的数据抖动。你目前用的FPGA是Xilinx还是Intel的?不同厂家的BRAM配置方式差别挺大的。

我建议你把关注点从「行缓冲深度1920」这个数字上挪开,面试官真正想考察的是你对流水线背压和数据连续性的理解。4K60帧的像素时钟大约530MHz,但FPGA通常只能跑到200MHz左右,所以AXI4-Stream的数据位宽必须做宽,比如64位位宽下每个时钟传两个像素,这样行缓冲的BRAM深度只需要960,但Sobel窗口的移位逻辑要改成每次读两个像素进来,然后做两次卷积计算。这个带宽计算的推导过程面试官很喜欢现场考,你得能当场写出公式:4096x2160x60≈530M像素/秒,用200MHz主频的话数据位宽至少64位才能满足。边界处理我强烈建议你用镜像填充,因为补0会让边缘梯度值偏小,导致边缘检测结果在图像四周有一条黑边,面试官看到你考虑到应用效果会很加分。实现时把行缓冲的地址截断改成镜像映射就行了,比如读地址addr=0时实际读BRAM的addr=1,addr=1时读addr=0,这样边缘像素的梯度值和内部区域保持一致。流水线结构我推荐三级:第一级从行缓冲同时读出3个像素,第二级做Gx和Gy的乘加运算,第三级算幅值并输出。注意第三级输出时要检查AXI4-Stream的tready信号,如果tready拉低,你的输出寄存器得保持当前梯度值不更新,同时内部流水线要暂停。整个设计里最容易翻车的地方是:行缓冲的写地址和读地址的同步关系。如果你用三个独立的双口BRAM,写地址用一个计数器循环,读地址比写地址滞后两拍,那窗口在滑动过程中自然对齐,不需要额外的地址计算逻辑。另外,我建议你在Sobel模块入口放一个深度为4的异步FIFO做弹性缓冲,把AXI4-Stream的背压和内部流水线解耦,这样即使内部偶尔stall,FIFO也能吸收抖动。你写代码的时候注意把tuser信号用来同步帧起始,如果上一帧还没处理完下一帧的tvalid就来了,流水线能自动清空内部状态而不丢数据。最后问一句,你准备用SystemVerilog还是纯Verilog写?接口定义上的语法差异可能影响你的代码风格。
发表回答
登录后可在本页底部提交回答