2026年FPGA校招,手撕Verilog实现一个AXI4-Stream的实时直方图均衡,累积分布函数怎么用流水线实现不丢帧?

开放11 回答 71 浏览

面试官让我手撕一个基于AXI4-Stream的实时直方图均衡,要求1080P60不丢帧。我知道直方图统计和CDF计算,但累积分布函数在硬件里怎么用流水线实现?是先把一帧的直方图统计完存BRAM,然后再逐像素查表映射吗?这样会有两帧延迟,面试官说不行,必须流水线处理。求大佬指点具体架构,怎么做到统计和映射流水线并行?

分享:

11 个回答

  • FPGA萌新上路

    双帧乒乓加一帧延迟,面试官说的那个'流水线'其实就是让你当前帧统计直方图的同时,用上一帧算好的CDF去映射当前帧的像素——这不叫两帧延迟,本质是一帧对齐。累加器流水线做CDF,BRAM查表,关键是把统计窗口和映射窗口错开一个像素行同步信号就行。你画个时序图,把vsync和hsync标清楚,面试官就能看明白。

  • 嵌入式小白成长记

    其实你提到的'先统计完一帧再查表'是教科书做法,但实时流里必须用滑动窗口或帧级乒乓。常见做法是用两块BRAM:一块做当前帧的直方图统计(写),另一块存上一帧算好的CDF查找表(读)。读这边每来一个像素就查表输出均衡后的值,写那边在像素有效信号来时对灰度值计数。等这一帧结束,帧同步信号触发交换角色。CDF的流水线实现就是把累加器拆成两段:第一段在每个像素时钟把对应bin的计数值读出来,第二段做累加并写回CDF的BRAM。这个累加器在帧有效期间一直跑,但注意要处理好帧起始时把累加器清零,避免上一帧残留数据。面试官要的就是这种'统计与映射并行'的结构,延迟严格等于一帧加几个时钟。你可以用Vivado或者Quartus画个block diagram讲,比纯写代码更直观。对了,你当前用的FPGA型号是什么?不同系列的BRAM深度会影响你CDF表的分辨率设计。

  • Data新手

    先说结论:你提到的'两帧延迟'常见于图像后处理的串行实现,但面试官要的流水线其实是在帧级粒度上做乒乓,统计和映射在时间上完全重叠。具体架构可以这样搭:准备两个RAM组,每组包含一个直方图统计RAM(深度256,宽度取决于像素计数最大值,1080P60一帧约2M像素,所以至少21bit)和一个CDF查找表RAM(同样256深度,但宽度是8bit输出)。帧N开始时,RAM组A做统计——每个像素时钟从AXI4-Stream的tdata里取出灰度值,对统计RAM对应地址加1;同时RAM组B里的CDF表已经准备好(来自帧N-1的计算结果),每个像素时钟查表输出均衡后的像素到tdata。帧N结束时,交换角色:RAM组B开始统计帧N+1,RAM组A的CDF表在这一帧间隙里用累加器流水线更新。累加器流水线的具体做法:用两拍寄存器——第一拍从统计RAM读取当前bin的值,第二拍加上上一拍累加结果,然后写回CDF RAM的对应地址。注意这里要用双端口BRAM,读端口给累加器用,写端口给更新CDF用,避免读写冲突。一个常见坑是:累加器在帧间隙里必须在一个行消隐内完成所有256个bin的累加,1080P60的行消隐约5.3us,256个时钟周期绰绰有余(一般FPGA跑150MHz以上没问题)。如果面试官还问AXI4-Stream的握手信号,你记得把tvalid和tready做成直通,只在映射路径上插入一个流水线寄存器保持时序。另外,个人建议你别只背架构,现场画个时序图——从帧同步信号拉高开始,标出统计窗口、CDF更新窗口、映射窗口的起止位置,面试官一般会点头。你目前是在准备实习面试还是正式校招?这两个阶段的考察深度不太一样,追问细节可以帮你调整准备重点。

  • 逻辑小白

    你提到的「先统计完一帧再查表」确实会有两帧延迟,面试官要的流水线其实是在帧级粒度上做乒乓。具体来说,准备两个BRAM组,每组包含一个统计RAM和一个CDF查找表RAM。帧N来时,A组统计当前帧的直方图,B组用上一帧算好的CDF做映射输出,等帧结束信号一到就交换角色。CDF的累加器流水线可以拆成两段:第一段在每个像素时钟读出对应bin的计数值,第二段做累加并写回CDF RAM,这个累加过程在帧有效期间一直跑,但记得帧起始时清零累加器。这样延迟严格等于一帧加几个时钟,完全满足1080P60。你画个时序图把vsync和hsync标清楚,面试官一眼就能看懂。你目前是用Vivado还是Quartus做仿真?工具不同,写testbench的侧重点会差一点。

  • 极简码农

    直方图均衡的流水线实现,核心在于把「统计」和「映射」在时间上完全重叠,而不是串行做。很多校招同学容易卡在「累积分布函数怎么流水」这个点上,其实CDF本质上是一个前缀和运算,在硬件里用累加器加流水线寄存器就能搞定,关键是要处理好帧边界的清零和角色切换。

    具体架构我建议这样搭:用两块双端口BRAM,每块深度256(对应灰度级),位宽至少21bit(因为1080P一帧大约2M像素,最大计数值约2^21)。每块BRAM同时承担两种角色——在统计帧N时,它的A端口每个像素时钟累加对应灰度级的计数值,B端口则用于查表输出上一帧的映射结果。帧结束时,一个简单的状态机交换两块BRAM的主从角色,同时把累加器清零。

    CDF的流水线实现可以分三级:第一级从统计BRAM读出当前像素灰度值对应的计数值,第二级做累加(累加器本身就是一个寄存器加加法器),第三级把累加结果写回同一块BRAM的另一个地址(作为CDF查找表)。注意这里读和写是同一个BRAM的不同端口,要避免读写地址冲突,常见做法是把读地址和写地址错开一个时钟周期。

    面试官真正想考察的,除了这个乒乓架构,还有你对AXI4-Stream握手信号的处理——tvalid和tready的配合,以及帧同步信号(tuser或自己定义的vsync)如何触发状态切换。你可以先用一个简单的灰度图做仿真验证,重点看帧切换时刻的输出是否连续。建议你手画一个block diagram,把数据流和控制信号标清楚,面试时比纯写代码更容易讲明白。你现在的仿真环境能生成1080P的测试激励吗?如果不行,可以先从640×480开始验证,逻辑是一样的。

  • 嵌入式开发萌新

    其实面试官说的「流水线」不一定非要在像素级做多级流水,对于直方图均衡这种帧级处理任务,帧级乒乓就是一种流水线——让统计和映射在时间上重叠。你遇到的根本问题不是CDF怎么算,而是怎么把两帧延迟压缩成一帧。

    一个容易被忽略的细节是:CDF累加器的清零时机必须精确对齐帧起始。如果你在帧有效信号(比如de)的下降沿清零,但下一帧的第一个像素还没到,这时候累加器里是上一帧最后一个有效像素的累加值,直接读出来做映射就会出错。正确的做法是用帧同步信号(vsync或tuser)的上升沿来触发清零,并且清零操作要提前一个时钟周期完成,保证帧第一个像素到来时累加器已经归零。

    另外,BRAM的读写冲突也要小心。统计阶段,每个像素时钟既要读统计RAM的当前计数值(用于累加),又要写回更新后的值,而映射阶段又要同时读CDF RAM。如果你用单端口BRAM,就必须把读写操作分时复用,这会导致统计和映射的吞吐率下降。所以推荐用真双端口BRAM,一个端口专用于统计的读写,另一个端口专用于映射的查表,互不干扰。

    如果你在学校做课设,可以先拿小分辨率(比如320×240)跑通这个乒乓架构,然后对比一下和直接串行实现的资源消耗。你会发现在BRAM数量上只多了一倍,但延迟从两帧降到了一帧,对于1080P60这种实时流来说是值得的。你手头有能生成AXI4-Stream视频流的IP核吗?没有的话可以用计数器模拟一个简单的像素流来验证。

  • 嵌入式入门生

    说实话,你卡在「累积分布函数怎么流水」上,其实是因为把「CDF计算」和「直方图统计」绑定得太紧了。一个常见的误区是以为必须等整帧统计完才能开始算CDF,但硬件里CDF的累加器可以在帧有效信号(de)拉高期间,每来一个像素就读出对应灰度值的当前计数值、加到自己身上,再写回CDF的BRAM——这个过程本身就是流水线,只是每一拍只处理一个灰度级。不过有个容易翻车的细节:如果同一灰度值连续出现,BRAM的读-改-写要在两个时钟内完成,否则会读出旧值导致累加错误。一个替代做法是用两个BRAM做双端口,一个端口读、一个端口写,配合寄存器旁路,这样读后立刻写,下一拍就能读到新值。另外,帧同步信号(vsync)的上升沿一定要提前一个时钟把累加器清零,不然第一个像素到来时累加器里是上一帧的尾巴,映射就会整体偏移。你当前是在做仿真验证还是已经上板调试了?不同阶段,testbench的构造重点差挺多的。

  • 嵌入式萌新

    其实面试官说「必须流水线」,你第一反应可能是要像图像处理核那样搞很多级寄存器,但直方图均衡的流水线是在帧级粒度上做乒乓,而不是像素级。核心思路就一句话:用两块BRAM组,一组统计当前帧的直方图,另一组用上一帧算好的CDF做映射输出,帧结束时交换角色。这样延迟严格是一帧,不会丢像素。

    具体到CDF的流水线实现,我推荐你分三级:第一级从统计BRAM的A端口读出当前像素灰度值对应的计数值(注意这里的BRAM是双端口,A口读,B口写),第二级用一个累加器把读出的值和上一拍的累加结果相加,第三级把累加结果写回到CDF查找表BRAM的对应地址。累加器本身就是一个带使能的寄存器,帧起始时用vsync的上升沿清零。这个三级流水线在帧有效期间每个时钟都能处理一个像素,完全满足1080P60的像素时钟要求(约148.5MHz)。

    但有个工程上的取舍:如果统计BRAM和CDF查找表共用同一块物理BRAM,读写冲突会变得很难处理。我的建议是直接上两块BRAM,每块深度256、宽度21bit(因为1080P一帧最多约2M像素,计数值上限2^21),这样面积开销不大,但时序收敛容易很多。你写Verilog时要特别注意AXI4-Stream的tready握手信号——如果下游反压,统计阶段的累加器也要跟着暂停,不能继续加,否则统计结果会偏。很多校招同学在这里翻车,只做了valid逻辑没处理ready反压。

    另外,如果面试官继续追问「能不能把延迟从一帧压缩到一行」,你可以提滑动窗口直方图,但那需要维护一个行缓存,复杂度跳一个量级,面试一般不会在45分钟内要求写出来。你目前是准备用Vivado还是Quartus做仿真?不同工具的IP生成器对BRAM配置的差异会影响你写代码的方式。

  • 嵌入式学习ing

    帧级乒乓加三级CDF流水线,延迟一帧。注意vsync清零要提前一拍,以及tready反压时累加器必须暂停。你先把AXI4-Stream的握手时序画清楚,面试官看这个比看代码快。

  • 数字电路小白

    校招面试里遇到这种题,其实面试官想看的不是你背一个现成的架构,而是你理解实时视频处理中'存储器冲突'和'帧级并行'这两个核心矛盾。你提到先统计完一帧再查表,那叫离线处理,在流式接口里肯定不能用。正确的思路是:用两块BRAM做乒乓,一块在帧N期间对每个像素的灰度值做累加计数(写操作),另一块同时用上一帧算好的CDF表做查表输出(读操作),帧结束时交换角色。这样统计和映射在时间上完全重叠,延迟严格一帧。

    你卡住的CDF流水线,其实是在帧有效信号拉高期间,每个时钟周期从统计BRAM的A端口读出当前灰度值的计数值,经过一级累加器(带使能),再把结果写回CDF查找表BRAM的对应地址。这个累加器本身就是一个三级流水线:读地址、累加、写回。但有个容易翻车的细节:如果同一灰度值连续出现,BRAM的读-改-写必须在两个时钟内完成,否则会读到旧值。一个常见做法是用双端口BRAM,一个端口专门读,一个端口专门写,配合寄存器旁路,这样读后立刻写,下一拍就能读到新值。

    另外,帧同步信号(vsync或者tuser)的上升沿一定要提前一个时钟把累加器清零,不然第一个像素来的时候累加器里是上一帧的尾巴,映射结果会整体偏移。你可以用Vivado画个时序图,把vsync、de、tready、累加器使能这几个信号标清楚,面试官看这个比看代码快。

    你目前是在用Vivado还是Quartus做仿真?不同工具的BRAM原语写法不太一样,Vivado推荐用xpm_memory,Quartus用altera_syncram,写testbench时侧重点也不同。如果你卡在BRAM的读写冲突上,可以试试先写一个单帧的直方图统计模块,单独仿真看清零时机对不对,再合到乒乓架构里。

登录后可在本页底部提交回答

提问者

电路板小白查看主页
浏览「就业招聘」

描述场景与已尝试方案,更容易获得有效解答

相关问题

同分类

提问建议

  • 标题写清核心疑问,避免「求助」「请问」等空泛用语
  • 正文补充环境、版本、报错信息或截图
  • 先搜索本站是否已有相近问题,减少重复提问
  • 若与课程相关,请标明课时或章节便于讲师定位