2026年FPGA校招笔试题:手撕Verilog实现一个AXI4-Stream的实时直方图均衡化,累积分布函数怎么用流水线实现?

开放8 回答 63 浏览

最近在刷FPGA校招笔试题,看到一道题让手撕Verilog实现基于AXI4-Stream的实时直方图均衡化,要求1080P60不丢帧。我用BRAM做直方图统计,但累积分布函数(CDF)的计算需要遍历256个bin,感觉流水线设计很复杂。面试官追问CDF的归一化怎么用移位代替除法,以及如何避免BRAM读写冲突。求大佬指点具体RTL设计思路和流水线级数分配,最好有伪代码或状态机设计。

分享:

8 个回答

  • Verilog代码练习者

    看到你提到双BRAM乒乓操作,其实顺着这个思路往下走CDF流水线没那么可怕。关键是要意识到,直方图均衡化的CDF计算在FPGA里并不是真的去算一个除法,而是查表加移位。你统计完256个bin之后,正常做法是做一个累加器,每个时钟周期读一个bin的值,加上前一个累加结果,然后右移8位。为什么能右移8位?因为1080P单帧总像素数大约是2百万,用20位计数器就能装下,而256个bin每个最多2百万,累加到最后就是总像素数,右移8位相当于除以256。面试官追问的核心其实是看你知不知道归一化因子就是总像素数,而总像素数对1080P来说是固定值,所以流水线里第0个bin的CDF归一化结果是0,第255个bin的结果是255,中间用移位代替除法完全没问题。

    关于BRAM读写冲突,乒乓操作本身就是为了解决这个的。你在帧有效信号期间写BRAM_A,读BRAM_B;消隐期反过来写BRAM_B,读BRAM_A。但要注意,消隐期很短,1080P的消隐期大概只有几十微秒,你要在这么短的时间里读完256个bin并算出CDF表。常见做法是把CDF计算状态机做成一个简单的四拍流水:第一拍读bin值,第二拍累加,第三拍移位,第四拍写回结果到另一个BRAM作为查找表。这样256个bin只需要256个时钟周期,一般1080P消隐期有几千个时钟周期,完全够用。

    你担心的流水线级数分配其实就这三四级,不需要搞复杂。状态机就三个状态:IDLE等待帧开始、STAT统计阶段(读BRAM_B同时写BRAM_A)、CALC计算阶段(消隐期读BRAM_A算CDF写BRAM_C)。面试时把乒乓切换的时序图画出来,标清楚帧同步信号和行同步信号的边界,基本就能过。

    另外有个坑你注意下:AXI4-Stream的tlast信号要和帧同步对齐,否则你统计的直方图会跨帧。建议在tuser里带上帧起始标志,或者直接用外部vsync信号做帧同步。你目前用的是什么开发板或者仿真环境?BRAM的读写时序和AXI接口的握手逻辑能对上吗?

  • 逻辑设计新人Leo

    双BRAM乒乓加流水线累加器,256个bin消隐期算完,右移8位代替除法,注意tlast对齐帧边界。面试官要是追问,你就说归一化因子固定所以移位可行,别被除法器吓到。

  • 芯片设计新人

    其实这道题的核心不是让你写一个完美的CDF计算器,而是考察你对帧消隐期利用率的理解。很多同学一上来就想着用流水线做实时除法,然后发现除法器延迟大,时序跑不到148.5MHz。正确的思路是,1080P60的像素时钟大约是148.5MHz,一个像素周期里你要同时完成读BRAM、累加、移位、写回四个操作?那肯定跑不了。所以实际做法是把CDF计算放到消隐期,用单周期累加器串行算256个bin,每个bin只需要一个时钟周期读、一个时钟周期算、一个时钟周期写,总共768个时钟周期。1080P的垂直消隐期大概有45行,每行消隐期有几百个时钟周期,加起来足够。你甚至可以不做乒乓,用单BRAM加读修改写操作,但要注意写使能时机不能覆盖统计阶段的数据。面试时画出消隐期的时间轴,标清楚哪里做统计哪里做计算,比讲一堆流水线寄存器更直观。建议你手边备一份1080P的时序参数表,面试官追问具体时钟数时能直接答出来。

  • 数字逻辑初学者

    说实话,这道题真正容易翻车的地方不是CDF流水线本身,而是你写Verilog的时候有没有把AXI4-Stream的握手信号处理干净。很多同学在仿真里对着固定数据流写代码,一到综合就被tready拉低搞崩。你的CDF计算如果打算在消隐期做,那消隐期里tvalid是低的,你可以随便跑状态机;但别忘了,一旦消隐期结束,tvalid重新拉高,你的CDF结果必须已经写回LUT,否则下一帧的像素进来直接查错表。我建议你写状态机的时候,把帧开始信号(比如tuser或自己生成的帧同步)和消隐计数器绑在一起,确保CDF计算在垂直消隐期最后几行完成,留个余量。至于BRAM冲突,乒乓是标准答案,但你要注意写使能别和读地址重叠,哪怕一个时钟周期的冒险都会让直方图统计出错。你目前是手写状态机还是用Vivado HLS在做?

  • 嵌入式玩家

    这条其实可以拆成两个独立的问题来看:一是CDF的流水线结构,二是AXI4-Stream时序对CDF计算窗口的限制。先讲CDF本身,256个bin的累加用三级流水线就够了——第一级读BRAM,第二级加法,第三级右移8位写回。右移8位的依据前面有人说过,是因为总像素数2M左右,除以256等于右移8位,这只有在归一化因子恰好是2的幂次时才成立。1080P60单帧总像素数是1920×1080=2073600,不是2的精确幂次,但实际工程里因为灰度级是256,你希望输出也是0到255,所以用右移8位相当于做截断近似,视觉上差别极小,面试官问的就是你能不能说出这个近似误差。然后回到AXI4-Stream,真正麻烦的是tready反压时你的状态机不能丢数据。建议做法:把直方图统计模块和CDF计算模块彻底分离,统计模块只负责在tvalid&tready有效时写BRAM,CDF计算模块用独立的时钟或门控时钟在帧消隐期启动,两者通过乒乓BRAM交换数据。这样就算传输被反压打断,统计结果也不会污染CDF计算。你写RTL的时候,别忘了给BRAM的写地址加一个帧计数器,防止多帧数据混在一起统计。

  • 数字IC萌新

    关于CDF流水线,大部分人一上来就盯着256个bin怎么用三级还是四级流水线,其实更关键的是你打算在什么时候算。如果你坚持在像素有效期内一边收数据一边算CDF,那确实要处理tready反压和BRAM读写冲突,状态机复杂度直接翻倍。但换个思路,把CDF计算全部推到消隐期去做,这时候AXI4-Stream的tvalid是低的,你完全不用担心握手信号。消隐期大概有几百个时钟周期可用,256个bin用单周期累加器串行算,每bin三级流水线也才768个周期,完全够用。这样设计的好处是统计模块和CDF计算模块可以解耦,统计模块只管写BRAM_A,CDF模块只管读BRAM_A,不需要乒乓也不会有冲突。唯一要注意的是帧同步信号要精确对齐,确保消隐期开始时统计已经结束。你可以用一个帧计数器加行计数器来产生消隐标志,比单纯靠tlast更可靠。另外归一化用右移8位的前提是总像素数接近2的幂次,1080P是2073600,右移8位得到8092而不是255,严格来说误差是有的,但视觉上人眼分辨不出。面试官问你的时候,主动提一句误差分析,比只说右移8位要加分。你目前状态机是写在哪个always块里的?

  • 码逻辑的小王

    这道题其实考的是你愿不愿意接受近似计算。很多在校生写代码追求精确,看到除法器就想用IP核或者Cordic,但FPGA做图像处理很多时候就是允许牺牲一点精度换面积和时序。直方图均衡化里的CDF归一化,理论公式是cdf(i) = 累积值 / 总像素数 255,但如果你把总像素数当成常数,把除法换成右移,那就要接受结果不是精确255。1080P的2073600除以256得到8100,右移8位相当于除以256,所以第255个bin的CDF归一化结果是 floor(2073600 / 256) = 8100,然后你还要截断到0到255范围,实际上是把8100映射到255,中间的非线性映射靠的是你后面的LUT查表。如果你用右移8位直接当LUT地址,那你的输出灰度级就不是均匀分布的,因为8100和255之间差了约31.7倍。正确的做法是先用累加器得到0到2073600的累积值,右移8位得到0到8100的中间值,再用一个BRAM做从8100到255的线性映射表。这个表在初始化时算好,运行时就是查一下。面试官如果追问,你就说右移8位只是把除法简化为移位,但真正的归一化映射还需要一级LUT。这样讲既展示了你对精度的理解,又体现了你实际工程中处理非2的幂次常数的能力。你如果时间允许,可以试试在仿真里对比一下精确除法和移位加LUT的输出图像差异,很小的。

  • CodeLearner

    其实吧,你就把CDF计算当成消隐期里的一个累加循环,256拍跑完,右移8位,tready反压根本不用管,因为那时tvalid是低的。面试官问BRAM冲突,你就说统计和计算分时复用,用帧同步信号切。别想复杂了,面试官自己写这段代码也差不多这样。

登录后可在本页底部提交回答

提问者

电子工程学生查看主页
浏览「其他」

描述场景与已尝试方案,更容易获得有效解答

相关问题

同分类

提问建议

  • 标题写清核心疑问,避免「求助」「请问」等空泛用语
  • 正文补充环境、版本、报错信息或截图
  • 先搜索本站是否已有相近问题,减少重复提问
  • 若与课程相关,请标明课时或章节便于讲师定位