最近在准备FPGA秋招,面试官让我手撕Verilog实现一个基于AXI4-Stream的实时YOLOv8n卷积加速器,脉动阵列的权重缓冲深度不知道怎么确定。我查了资料,说要根据卷积核大小和并行度来算,但具体怎么推导?比如3×3卷积,PE阵列是4×4,权重缓冲深度是不是等于输入通道数除以并行度?还有边界像素怎么处理才能不丢帧?求大佬给个具体推导步骤和仿真波形示例,不然面试官一问就懵了。
2026年FPGA秋招,面试官问Verilog实现AXI4-Stream实时YOLOv8n卷积加速器,脉动阵列的权重缓冲深度怎么确定?求具体推导和仿真波形
11 个回答

面试官问权重缓冲深度,其实核心是看你的PE阵列在时间上怎么复用权重。3×3卷积,4×4的PE阵列,如果按常见做法一次处理4个输入通道、同时输出4个输出通道,那权重缓冲深度就是输出通道数除以PE阵列的行数(也就是4),再乘以卷积核大小3×3,也就是9。但更关键的是你要讲清楚为什么这样算:每个PE需要独立加载一组权重,深度不够会导致PE空等。边界像素不丢帧,常见做法是在输入行缓冲里做对称填充或零填充,提前在数据流里补好,别等到了边界再临时插帧。你手撕Verilog的时候,建议先画个时序图,把权重加载和有效数据到达的节拍对齐,面试官一看就懂。你现在是用Vivado还是Quartus做仿真?

这个问题我建议你别只看深度公式,得先想清楚脉动阵列的权重加载策略。常见有两种:一种是权重一次性广播到所有PE,那深度就是卷积核大小乘以输入通道数除以并行度,但这样对AXI4-Stream带宽要求高;另一种是权重在阵列内流水传递,每个PE只存自己那部分,深度可以压到单组权重的周期数。你提的3×3卷积、4×4阵列,如果按输出通道并行度4来算,权重缓冲深度一般是 (33输入通道数/4) 再向上取整到最近的行周期数。但面试官真正想听的,是你怎么处理权重重载和计算重叠——比如用双缓冲,一个缓冲区加载下一层权重,另一个供给当前计算。边界像素的话,很多新手直接在输入数据流里补零,但这样会打乱AXI4-Stream的tready/tvalid握手,正确做法是在行缓冲FIFO里预留两行做padding,用状态机控制边界时读出的地址偏移。你推导的时候最好画个波形图,标出权重加载窗口、有效数据窗口和空闲周期,面试官会认可你的工程思维。另外,YOLOv8n有多个不同尺寸的卷积层,你打算统一用一个深度还是每层单独优化?这个取舍也值得在回答里提一嘴。

关于权重缓冲深度,我补充一个容易踩的坑:很多人只算卷积核大小和并行度,忽略了AXI4-Stream的背压。如果上游数据没准备好,权重缓冲会提前读空,导致PE阵列空转。实际推导时,深度应该等于 (卷积核行数 输入通道每行数据数 / PE列数) 加上两个时钟周期的余量,用来吸收握手延迟。比如3×3卷积,输入特征图宽度是640,PE阵列4列,那深度就是 (3 640 / 4) + 2,大概482。边界像素处理,我见过一种更省资源的做法:在脉动阵列的输入侧加一个环形缓冲,把边界像素复制一份,这样不需要额外填充逻辑,但会多消耗BRAM。你可以跟面试官说,具体用哪种取决于你的BRAM余量和时序要求。最后提醒一句,面试官问这个题,大概率不是要你当场算出一个精确数,而是看你有没有考虑过数据流和握手协议的交互。你准备的时候,最好用Vivado写个简单的testbench,测一下不同深度下的吞吐量,把波形截下来当面试素材。你目前仿真环境搭好了吗?如果还没,我建议先用ModelSim跑个简单的点乘单元验证一下思路。

面试官考这个,其实不是要你背公式,是想看你有没有意识到权重缓冲深度和AXI4-Stream的tready/tvalid握手是联动的。你只要说清楚深度至少要能覆盖一次卷积窗口内所有PE的权重加载周期,再加2到4拍余量防背压,边界像素用行缓冲做对称填充就行。波形图重点标出valid和ready的握手对齐时刻,面试官就满意了。

推导权重缓冲深度,我建议你先别管公式,而是从脉动阵列的数据流图开始画。假设4×4的PE阵列,你打算一次处理4个输入通道、输出4个输出通道,那每个PE在计算一个3×3卷积窗口时,需要加载9个权重。但权重不是一次全塞进去的,常见做法是按行流水传递——第一个PE接收第一行权重,算完再传给下一行PE。这时候缓冲深度就不是简单的输入通道数除以并行度了,而是要考虑阵列的流水级数。比如你的阵列有4行PE,权重从顶端流入、底端流出,那缓冲深度至少要能存下4行权重,也就是4乘以3(卷积核行数)再乘以输入通道组数,比如12。边界像素处理有个省BRAM的技巧:在输入侧用双行缓冲,提前把当前行和下一行数据对齐,边界时从缓冲里重复读边缘像素,而不是在数据流里插零——这样tready不会莫名其妙拉低。你仿真时如果发现valid抖动,八成是缓冲深度没留够握手余量。你现在是用Vitis HLS还是手写RTL?

边界像素不丢帧,我见过一个更直接的方案:在输入AXI4-Stream的s_axis_tuser信号里带上帧起始和行起始标记,用状态机在行缓冲里做边界判断。比如3×3卷积,行缓冲深度设成特征图宽度加2,这样边界时直接读缓冲里已有的数据,不用临时改tready。权重缓冲深度的话,你先把卷积核大小、PE阵列维度、输入通道并行度三个参数列成乘法关系,再除以输出通道并行度,最后向上取整到最近的时钟周期数。比如334/4=9,但实际因为AXI握手可能空一拍,得设成12。面试官如果追问为什么不是9,你就说留了25%的余量处理背压,他一般会点头。你现在仿真用的Testbench是自己写的还是用VIP?

你问的权重缓冲深度,表面是个除法问题,但面试官真正想看的是你能否把「卷积核大小」「PE阵列维度」「输入通道并行度」这三个参数从静态数变成动态时序约束。我建议你从握手协议的反压周期入手推导。假设3×3卷积、4×4脉动阵列、一次处理4个输入通道、输出4个输出通道。PE阵列每行有4个PE,每个PE在计算一个3×3窗口时需要9个权重。权重加载方式常见是行流水——权重从阵列顶端流入,每拍流入一行权重(比如3个),经过4拍才能让所有PE得到所需数据。但AXI4-Stream的tready/tvalid握手不是每拍都有效,可能出现背压。所以你需要的缓冲深度不是输入通道数除以并行度,而是要覆盖流水线所有PE都获得一次完整权重所需的最大节拍数,再乘上卷积核行数。我算过一种常见情况:权重缓冲深度 = (卷积核行数 × PE阵列行数) × 权重行周期数 + 2拍余量。例如3行权重 × 4行PE × 3拍(每行权重流入需3拍) + 2 = 38。但这里的3拍是基于每拍流入一个权重行且握手成功,如果握手延迟多一拍,深度就要加。边界像素处理,我见过最高效的方式是在输入侧用双行缓冲FIFO,深度为特征图宽度+2,用状态机在边界时从FIFO内重复读边缘像素,而不是在数据流里插零——这样tready不会被拉低。你仿真时如果发现valid抖动,八成是握手时序没对齐。建议你写个简单的Testbench,只测权重加载模块,用计数器模拟tready拉低场景,看缓冲是否先读空。你现在是用Vivado还是Verilator做仿真?如果还没开始写TB,先别纠结精确深度值,画个波形图把valid/tready握手节拍标清楚,面试官就满意了。

深度别硬套公式,画个4×4阵列的权重流水时序图,数出最坏情况下的握手等待拍数再加2就行。边界像素用行缓冲提前补边,别在AXI流里临时改数据。

你提到的「输入通道数除以并行度」只是理想情况下的理论值,实际面试官更在意你能否意识到AXI4-Stream握手的反压(tready拉低)会导致权重加载暂停。我建议你把推导拆成两步:先算理想吞吐下的最小深度,再根据握手协议的最坏等待拍数加余量。比如3×3卷积、4×4阵列、4通道并行,理想深度是9(3×3),但考虑每拍可能等待2个时钟周期,深度就变成9×2=18。边界像素不丢帧的关键是行缓冲的读取地址控制——在边界时让地址回退到边缘像素,而不是插入空数据。你手撕Verilog时可以先写一个权重加载的有限状态机,把握手状态机和缓冲深度解耦,这样调试起来更清晰。有个误区是很多人把权重缓冲深度和PE阵列的流水级数混为一谈,其实深度只影响加载阶段的背压吸收,流水级数决定计算延迟,两者要分开设计。你准备面试时,建议用Excel或Paper画出时序图,把每个PE的权重加载节拍标出来,面试官一看就懂你的推导逻辑。

你这个问题,我猜面试官其实不是让你当场算个精确数,而是想看你有没有意识到权重缓冲深度跟AXI4-Stream的背压是绑在一起的。先别急着套输入通道数除以并行度的公式,那只是理想情况。我建议你从脉动阵列的权重加载流水线入手:比如3×3卷积、4×4阵列,如果权重是按行流水从顶端流入,那最坏情况是某一行PE因为tready拉低,导致整行权重更新卡住,这时候缓冲深度至少要能覆盖一次完整卷积窗口内所有PE的权重需求量,再乘上你系统里最长的反压周期数。边界像素不丢帧,我见过一个省事的做法是在行缓冲里预先多存两行,用状态机判断当前像素是不是在特征图边缘,如果是,就把行缓冲的读地址回退到边界像素,而不是临时改tready——这样握手信号不会乱跳。你写仿真波形时,重点标出valid和ready的握手对齐时刻,以及缓冲空标志的变化,面试官看到这个细节就会觉得你懂协议。另外有个风险点:权重缓冲深度设太大浪费BRAM,设太小又会因为背压导致PE空转,所以最好先用一个简单的Testbench跑一下最坏情况,比如模拟上游每5拍才给一次valid,看看缓冲会不会读空。你现在仿真工具用的是Vivado还是Questasim?
发表回答
登录后可在本页底部提交回答