面试官给了个场景:摄像头输入1080p视频流,要求用Verilog实现AXI4-Stream接口的实时直方图均衡化。我卡在累积分布函数计算那块,如果每帧都重新统计直方图再算CDF,BRAM根本不够用,而且延迟很大。面试官追问能不能用双缓冲乒乓操作,或者用滑动窗口近似?求大佬指点具体架构设计,最好有代码框架和资源估算,2026年秋招太卷了,这种题答不上来直接挂。
2026年FPGA校招,面试官让我手撕Verilog实现一个AXI4-Stream实时视频直方图均衡化,累积分布函数怎么用流水线算才能不浪费BRAM?
8 个回答

面试官问这个其实想看你有没有意识到直方图均衡化在实时视频里的BRAM瓶颈。我的思路是别把一整帧的直方图全存了,改用滑动窗口加近似CDF。比如每来一行像素,本地维护一个行级直方图,然后累积到全局CDF时用双缓冲乒乓,一帧的统计结果送给下一帧用。这样延迟只多一帧,BRAM用量从存一帧图像降到存几个行缓冲和一个256深度的直方图数组。代码框架上就是两个双端口BRAM来回倒,一个写当前帧直方图,一个读上一帧的CDF做映射。面试官追问双缓冲时,你可以主动提一句资源估算:1080p下用单端口BRAM 36Kb大概需要3~4块。你现在是用Vivado还是Quartus在练?

说个实际点的取舍吧,你如果硬要每帧重算直方图,BRAM确实会爆。1080p一帧大概2百万像素,直方图用256个累加器,每个累加器至少18bit才不溢出,这就4.5Kbit BRAM,你还要存CDF映射表,再加行缓冲,一块36Kb BRAM勉强能兜住。但面试官想听的其实是你对延迟和资源权衡的理解。我建议你这么说:用双缓冲乒乓,A BRAM统计当前帧直方图,B BRAM存上一帧算好的CDF映射表。每次像素进来只更新A,帧同步信号来了立刻交换AB,同时用流水线把A的直方图转成CDF。这样BRAM只用两块,延迟只多一帧。至于滑动窗口近似,那是另一种思路,适合对精度要求不高的场景,比如每256个像素算一次局部CDF,但面试题里既然给了实时视频,大概率是想考你乒乓操作。另外提一句,CDF的流水线可以用加法树来算,但注意要把直方图读出来做前缀和时插一拍寄存器,不然组合逻辑会很长。你实习时用过AXI4-Stream的ready/valid握手吗,这个面试官多半也会接着问。

这道题我面过类似的,当时也被追问了BRAM优化,后来复盘发现核心在于理解CDF计算的流水线本质。直方图均衡化分三步:统计直方图、算CDF、映射。BRAM浪费主要出在统计阶段——如果你每个像素都写一次BRAM,那每一拍都要读旧值加1再写回,BRAM的双端口正好能处理:一个端口读旧值,另一个端口写新值。但别忘了,1080p的像素时钟通常在74.25MHz以上,BRAM读改写的延迟会导致流水线停顿。正确做法是给直方图地址和累加值打两拍流水,让BRAM写使能晚两拍生效。CDF那块,用双缓冲乒乓其实是最稳妥的做法:帧同步信号到来时,当前帧的直方图已经统计完,交换到后台BRAM,再用组合逻辑或短流水线算前缀和,同步给下一帧用。资源估算上,256x18bit的直方图用一块36Kb BRAM就够了,CDF映射表另用一块,总共两块BRAM,再加两块做行缓冲(如果要做滑动窗口近似)。但面试官如果追问为什么不用滑动窗口,你得能说清楚:滑动窗口近似会引入块效应,对视频画面来说人眼敏感,而乒乓操作只延迟一帧,效果和离线算一样。面试官继续深挖的话,可能会问你如何用AXI4-Stream的TLAST信号来对齐帧边界,或者如何在TREADY拉低时保持直方图统计的正确性。建议你手边备个代码模板,把状态机写清楚:IDLE等待帧起始、HIST统计、CDF计算、MAP映射。最后提醒一句,2026年秋招很多公司开始问HLS和Verilog混合设计,这道题其实也可以用HLS的流水线pragma写C转RTL,但面试官大概率想听你纯手撕的功底。你现在刷题时,有在GitHub上开个仓库专门整理这些架构模板吗?

面试官问这个其实是想看你对流水线延迟和BRAM读写时序有没有直觉。直方图统计那步,每个像素都要读旧值再加1写回,BRAM读改写的两拍延迟刚好用双端口抵消:一个端口读,一个端口写,中间插两拍寄存器打平。CDF计算更简单,帧同步来时把直方图双缓冲交换,后台用加法树做前缀和,同步给下一帧用。总共两块36Kb BRAM,一块统计直方图,一块存CDF映射表,搞定。你用的Vivado还是Quartus?

兄弟,我去年面过类似题,说点血泪教训。你纠结BRAM不够,其实面试官真正想听的是你知不知道「实时视频能容忍一帧延迟」这个前提。双缓冲乒乓确实是标准解法:A BRAM写当前帧直方图,B BRAM存上一帧算好的CDF,帧同步信号一来就交换指针。但有个坑——CDF计算本身需要256个累加器,如果你用纯组合逻辑做加法树,综合出来资源爆炸。正确做法是分时复用:帧消隐期间(1080p大概几百行空白时间)用单加法器串行算前缀和,一个时钟算一个地址,256个周期搞定,完全不影响视频流。这样BRAM只占两块36Kb,加法器只占一个。另外AXI4-Stream接口要注意tvalid/tready握手,CDF映射表的查表逻辑必须插在像素数据流的流水线上,否则映射那步会卡住整条链路。我建议你写代码时先把直方图统计模块和CDF计算模块分开,中间用双缓冲的BRAM桥接,这样后期调时序也方便。你目前是用Vivado的IP Integrator搭还是纯手写RTL?

滑动窗口近似其实是在面试里加分但别当主答案的点。面试官问了双缓冲,你就顺着他说:用两块BRAM乒乓,一块写当前帧直方图,一块读上一帧CDF,帧消隐期用单加法器串行算前缀和。资源估算精确点——1080p像素时钟74.25MHz,256个地址串行算CDF只要256个周期,消隐期至少几百行,时间完全够。真要炫技,可以提一句直方图统计阶段用双端口BRAM的读改写,把累加逻辑打两拍流水避免冲突。但别把滑动窗口说成替代方案,面试官大概率想考的是你对乒乓操作和帧延迟可接受的理解,近似算法显得你跑题。你写CDF那部分时,注意把加法器的使能信号和帧同步对齐,不然边界条件容易漏像素。

说实话,这道题面试官真正想看的不是你能不能写出一个完美的CDF流水线,而是你有没有意识到「实时视频直方图均衡化」这个场景下,延迟和资源是必须二选一的。你纠结BRAM不够用,其实根本思路就偏了——1080p视频流,一帧大概2百万像素,直方图只需要256个累加器,每个累加器18bit才4.5Kbit,一块36Kb BRAM绰绰有余;CDF映射表再占一块,总共两块BRAM就能兜住。问题出在时序和流水线设计上。直方图统计阶段,每个像素进来都要读旧值加1写回,BRAM双端口正好能处理读改写,但你必须把读地址和写地址错开两拍,否则写使能跟读数据冲突,综合出来就是一堆LUT。CDF计算更简单——帧消隐期1080p至少几百行空白时间,你用一个加法器串行算前缀和,256个时钟周期搞定,根本不用加法树。双缓冲乒乓操作是标准答案:A BRAM写当前帧直方图,B BRAM存上一帧算好的CDF,帧同步信号一来就交换指针。面试官追问滑动窗口近似时,你千万别当主答案,那东西适合局部对比度增强,不是全局均衡化,提一句「可以用在精度要求不高的场景」就够了,说多了显得你跑题。建议你回去先把AXI4-Stream的tvalid/tready握手逻辑写熟,然后重点练BRAM读改写的流水线打法,Vivado里用两个寄存器打一拍延迟就能解决。另外,代码里CDF映射表的查表逻辑必须插在像素数据流的流水线上,否则映射那步会卡住整条链路。你现在主要用哪家EDA工具?

说实话,这道题面试官真正想看的不是你能不能写出一个完美的CDF流水线,而是你有没有意识到「实时视频直方图均衡化」这个场景下,延迟和资源是必须二选一的。你纠结BRAM不够用,其实根本思路就偏了——1080p视频流,一帧大概2百万像素,直方图只需要256个累加器,每个累加器18bit才4.5Kbit,一块36Kb BRAM绰绰有余;CDF映射表再占一块,总共两块BRAM就能兜住。问题出在时序和流水线设计上。直方图统计阶段,每个像素进来都要读旧值加1写回,BRAM双端口正好能处理读改写,但你必须把读地址和写地址错开两拍,否则写使能跟读数据冲突,综合出来就是一堆LUT。CDF计算更简单——帧消隐期1080p至少几百行空白时间,你用一个加法器串行算前缀和,256个时钟周期搞定,根本不用加法树。双缓冲乒乓操作是标准答案:A BRAM写当前帧直方图,B BRAM存上一帧算好的CDF,帧同步信号一来就交换指针。我建议你写代码时先把直方图统计模块和CDF计算模块分开,中间用帧有效信号做握手,这样调试也方便。另外提醒一句,AXI4-Stream的tlast信号别忘了处理,不然帧边界对不准,映射出来的图像会错位。你现在是用Vivado还是Quartus在练?
发表回答
登录后可在本页底部提交回答