海思面试官现场出的题,要求用Verilog实现AXI4-Stream接口的实时HDR融合,多帧曝光数据怎么用流水线对齐才能保证不丢帧?我想的是用FIFO做帧缓冲,但面试官说资源有限,得用行缓冲加乒乓操作。求具体对齐方案,包括帧同步信号怎么处理、行缓冲深度怎么算、以及时序波形图。
2026年FPGA校招,海思面试官让我手撕Verilog实现一个AXI4-Stream的实时HDR融合,多帧曝光怎么用流水线对齐才能不丢帧?
12 个回答

面试官说资源有限,那FIFO帧缓冲的方案大概率会被砍掉,因为帧存需要整帧RAM,对BRAM消耗太大。他提到行缓冲加乒乓操作,其实就是用两个行缓冲交替写读,每来一行数据就切换一次,这样多帧曝光数据就能在流水线上对齐。关键点在于帧同步信号——你得把每帧的起始行标志和曝光序号绑在一起传递,行缓冲深度算一行像素数就行,但要注意AXI4-Stream的ready/valid握手不能断,否则丢帧。时序上画出三帧数据连续输入、行缓冲交替输出的波形就清楚多了。你当前是在用哪个工具链做仿真?Vivado还是Quartus?

这道题其实考的是对流水线架构的理解,而不仅仅是Verilog语法。面试官给你的约束是资源有限,那就要放弃整帧缓存,转而用行级的乒乓来对齐多帧曝光。具体思路是:假设HDR融合需要三帧不同曝光的图像(短、中、长),它们来自同一场景但曝光时间不同,所以帧同步信号必须对齐。你可以在输入侧用三个行缓冲组,每组两个缓冲做乒乓,每来一行数据就根据当前帧计数写入对应的行缓冲。当三帧的同一行都写完后,同时读出送给融合模块。行缓冲深度等于一行最大像素数,这个要根据你的图像分辨率定,比如1080p就是1920。不丢帧的关键在于流水线要能连续处理——当当前行正在融合时,下一行的数据已经开始写入另一组缓冲了,这就是乒乓的妙处。帧同步信号的处理建议用计数器加状态机,每个行同步脉冲到来时递增行号,同时把帧起始标志和曝光序号打包成元数据随路传递。时序波形图可以画三行:第一行是AXI4-Stream的tvalid/tready握手,第二行是三个行缓冲的写使能交替,第三行是融合模块输出。另外,面试官可能还期待你考虑行缓冲的读写地址控制,以及跨时钟域问题——如果输入和融合模块时钟不同,还得加异步FIFO。你准备的时候最好手画一遍波形,把每个时钟周期的数据流动标清楚。个人感觉这种题面试官更看重你的工程思维,代码反而不是最难的。你目前对AXI4-Stream的握手协议熟悉到什么程度?

面试官特意点出行缓冲加乒乓,其实是在暗示你避免用FIFO做帧缓冲的常见误区。很多同学第一反应就是FIFO,但帧缓冲对BRAM的消耗是行缓冲的几百倍,海思做芯片最看重面积和功耗,所以肯定会砍掉。你的方案里,行缓冲深度等于一行像素数,这个值要写死,不能动态调整——面试官可能会追问如果输入分辨率可变怎么办,这时候你可以提用AXI4-Stream的tuser信号携带行有效数据长度,或者用参数化设计。一个容易忽略的风险是:如果三帧曝光数据的行数不完全相同(比如短曝光帧因为读出快而多出一行),你的流水线控制逻辑要能处理行数不匹配,否则会丢帧或者错位。建议加一个行计数器,当三帧的同一行都到达后才触发融合,如果某帧提前结束就插入空行对齐。另外,时序波形图里一定要标出乒乓切换的瞬间,比如第N行写入缓冲A时,第N-1行正在从缓冲B读出,这样面试官才觉得你理解了并行流水。其实这道题还有另一种思路:用双端口RAM做行缓冲,读写地址独立,可以省掉乒乓控制的额外逻辑,但代价是RAM位宽要加倍,看你更倾向哪种。你目前有在准备HDR算法本身吗?还是只关注接口实现?

面试官点出乒乓操作,其实是想看你有没有实际做过资源受限的流式设计。FIFO做帧缓冲太奢侈,行缓冲加乒乓才是正经做法——每来一行数据,三个帧的行缓冲交替写,等三帧同一行凑齐了再同时读出去融合。帧同步信号跟着每帧的起始标志走,行计数器要能处理多帧行数不完全一致的情况,不然短曝光帧多出来的一行会打乱流水线。你用的Verilog仿真工具是VCS还是Vivado?

个人感觉这道题的核心不是HDR算法本身,而是流水线节奏的控制。面试官给的行缓冲加乒乓方案,本质是把帧级并行拆成行级流水。具体操作上,你可以设三个双口RAM组,每组两个缓冲做乒乓,深度等于一行最大像素数。写侧:每帧的行同步脉冲到来时,根据当前帧号往对应缓冲写,同时用一个行计数器记录当前处理到第几行。读侧:当三帧的同一行都写完后,同时使能读操作,把三行数据送给融合模块。帧同步信号要跟着数据流走,可以用一个移位寄存器把帧起始标志和曝光序号绑在每行数据的第一个像素上。容易忽略的一点是,如果三帧的行数因为读出速度不同而不等,可以在帧结束时补空行对齐,或者在状态机里做超时处理。你目前是想用在ISP Pipeline里还是独立的HDR模块?

面试官说资源有限,你第一反应是FIFO,这其实暴露了对片上存储资源的理解不够细。海思做芯片最抠面积,一个1080p的帧缓冲要近4MB BRAM,而一行缓冲只要不到200KB,差了两个数量级。所以行缓冲加乒乓是必然选择。具体对齐方案可以这样拆:首先,每个曝光帧配一组行缓冲,每组内部两个缓冲乒乓切换。写侧,当行同步有效时,根据当前帧号选择对应组,并利用乒乓标志切换写缓冲;读侧,等三个帧的同一行都写完后,同时触发读,并输出一个行有效信号给融合模块。帧同步信号的处理建议用元数据随路方式——把帧起始和曝光序号打包成一个sideband信号,跟行数据一起在AXI4-Stream的tuser上传递。时序上要注意乒乓切换的瞬间:当第N行写入缓冲A时,第N-1行正从缓冲B读出,这样流水线才能连续。一个比较隐蔽的风险是,如果三帧的行同步频率不同(比如长曝光帧的行周期更长),你的读控制逻辑必须等最慢的那帧到达才能触发融合,否则会丢行。可以加一个行就绪计数器,当三帧的同一行都就绪后才发出读使能。你现在的设计里,帧同步是用的同步复位还是异步复位?这个会对时序收敛有影响。

你第一反应是FIFO,面试官说资源有限,这其实是在考察你对片上存储的敏感度。海思做芯片最抠面积,一个1080p的帧缓冲要吃掉近4MB的BRAM,而一行缓冲只要不到200KB,差了两个数量级。所以行缓冲加乒乓是必然选择。具体对齐方案可以这样拆:首先,每个曝光帧配一组行缓冲,每组内部两个缓冲乒乓切换。写侧,当行同步有效时,根据当前帧号选择对应组,并利用乒乓标志切换写缓冲;读侧,等三个帧的同一行都写完后,同时触发读,并输出一个行有效信号给融合模块。帧同步信号的处理建议用元数据随路方式——把帧起始和曝光序号打包成一个sideband信号,跟行数据一起在AXI4-Stream的tuser上传递。时序上要注意乒乓切换的瞬间:当第N行写入缓冲A时,第N-1行正从缓冲B读出,这样流水线才能连续。一个比较隐蔽的风险是,如果三帧的行数因为读出速度不同而不等,可以在帧结束时补空行对齐,或者在状态机里做超时处理。你目前是想在ISP Pipeline里用这个模块,还是做独立的HDR融合?这个会影响你接口握手的反压设计。

面试官点出乒乓操作,其实是想看你有没有实际做过资源受限的流式设计。FIFO做帧缓冲太奢侈,行缓冲加乒乓才是正经做法——每来一行数据,三个帧的行缓冲交替写,等三帧同一行凑齐了再同时读出去融合。帧同步信号跟着每帧的起始标志走,行计数器要能处理多帧行数不完全一致的情况,不然短曝光帧多出来的一行会打乱流水线。一个容易忽略的点是AXI4-Stream的ready/valid握手不能断,如果你在等待某帧的行缓冲被读空,写侧的反压要提前拉低,否则丢帧。你用的Verilog仿真工具是VCS还是Vivado?这个会影响你调试时看波形的方式。

兄弟,你被面试官点出FIFO帧缓冲的问题,其实是个好事——说明他愿意往下挖你的架构意识。海思这种芯片公司,对片上存储的敏感度是刻在骨子里的,一个1080p帧缓冲要吃掉将近4MB BRAM,而一行缓冲只要几十KB,差了两个数量级。面试官提行缓冲加乒乓,不是要你临时想个奇技淫巧,而是考察你有没有做过流式设计的取舍。具体对齐方案的核心在于:把帧级并行拆成行级流水。你可以给每帧曝光配一组双口RAM组,每组内部两个缓冲乒乓切换,深度固定为一行最大像素数。写侧,行同步脉冲到来时,根据当前帧号选组,用乒乓标志切换写缓冲;读侧,等三帧的同一行都写完后,同时使能读,把三行数据送给融合模块。帧同步信号的处理,建议用sideband方式——把帧起始标志和曝光序号打包成一个元数据,跟数据一起在AXI4-Stream的tuser上传递,这样每行数据都自带身份标签,不会错位。时序上要特别注意乒乓切换的瞬间:当第N行正在写入缓冲A的数据端口时,第N-1行应该已经写入缓冲B且正在被读出,这样流水线才能连续。一个很容易被忽略的坑是,如果三帧的行数因为曝光时间不同而不等(比如短曝光帧读出速度快),你的行计数器需要能够在帧结束时补空行对齐,或者在状态机里做超时处理,否则短帧多出来的那一行会把后续流水线打乱。你目前是在用Vivado做仿真还是VCS?这个会影响你调试流水线反压的方式,因为不同工具对AXI4-Stream握手的波形可视化支持不太一样。

面试官说资源有限,其实是在给你铺台阶——行缓冲加乒乓是标准答案,你顺着往下走就行。核心就两点:一是行缓冲深度按最大分辨率写死,比如1080p就是1920个像素;二是帧同步信号要随路,用AXI4-Stream的tuser携带帧序号和行序号,这样三帧数据即使交错到达也能按行对齐。时序上画个三帧数据连续输入的波形,标出写缓冲A、读缓冲B的切换点,再画一行融合输出,面试官就能看出你理解流水线连续性。记得提一嘴反压处理,如果读侧融合模块来不及收,写侧的ready要提前拉低,否则丢帧。你之前用过AXI4-Stream的tkeep信号做字节使能吗?那个在HDR里可能用得到,如果像素深度不是整数字节的话。
发表回答
登录后可在本页底部提交回答