最近在准备FPGA校招,刷到不少面经提到手撕Verilog实现图像旋转。我自己试了一下,用双线性插值做任意角度旋转,坐标变换用CORDIC算,但行缓冲深度怎么推导都搞不明白。比如旋转45度,输出像素需要映射到输入图像多个行,行缓冲到底要存多少行才能保证不丢帧?面试官说还要考虑AXI4-Stream的tlast信号对齐,求大佬给个具体推导和Verilog代码框架,最好能分析资源消耗。
2026年FPGA校招,面试官让我手撕Verilog实现AXI4-Stream实时图像旋转,双线性插值坐标变换和行缓冲深度怎么设计才能不丢帧?
11 个回答

行缓冲深度推导其实跟旋转角度和输入图像宽高有直接关系,不需要记公式,画个图就能推出来。你拿一张4:3的图旋转45度,输出像素的坐标映射回输入图时,最斜的那条扫描线会跨过好几行。一般做法是算最大垂直偏移:旋转后输出像素在输入坐标系下的y坐标变化范围,除以输入图像的行高,向上取整再加1到2行余量。比如旋转45度,输入宽W,输出高H,最大偏移大约是 (Wsin45 + Hcos45) / 1,但更精确的是取 abs(sinθ)W + abs(cosθ)H 除以行数。实际工程里,行缓冲深度至少是 ceil( abs(sinθ)W ) + 2,因为双线性插值需要上下两行,加上流水线延迟和tlast对齐,建议再加2行。CORDIC算坐标没问题,但注意迭代次数要足够,不然插值结果会偏。AXI4-Stream的tlast对齐其实是个状态机问题:每输出一行完成时,要保证行缓冲里下一行数据已经准备好,否则丢帧。一个实用技巧是让行缓冲深度等于最大需要的行数,然后用双端口RAM乒乓操作,读端口独立于写端口,这样写端永远不阻塞。资源消耗上,行缓冲用BRAM比分布式RAM省面积,但要注意BRAM的延迟会多一个周期,需要调整读地址时序。你目前是准备用块RAM还是分布式RAM?这个选择会影响你的Verilog写法。

行缓冲深度 = ceil( |sinθ| 输入宽度 ) + 2,45度时就是 输入宽度0.707 + 2,约等于输入宽度的七成。面试官其实更想看你能不能现场画图推导,而不是背结论。代码框架建议先写坐标变换模块和插值模块,行缓冲用移位寄存器阵列,别一上来就上FIFO。

这个题我去年校招被问过两次,第一次挂了,第二次过了,区别就在于对行缓冲的理解深度。面试官真正想考察的不是你会不会写Verilog,而是你有没有意识到实时图像处理中数据流和存储的匹配关系。先说坐标变换:CORDIC算角度是标准做法,但如果你用查找表代替,资源更省,精度也够,校招面试里提这个会加分,说明你懂取舍。行缓冲深度推导,我建议你从另一个角度想——输出像素的y坐标变化率。旋转后的图像,假设输出是逐行扫描的,每个输出像素对应输入图像的一个浮点坐标。最坏情况是旋转45度时,输出像素的y坐标变化最快,因为输入图像的x方向分量完全贡献给了y方向。具体来说,输出坐标 (x_out, y_out) 映射回输入坐标 (x_in, y_in) 的公式是:x_in = x_outcosθ – y_outsinθ, y_in = x_outsinθ + y_outcosθ。固定y_out,x_out从0到W_out变化时,y_in的变化范围是 W_out |sinθ|。如果输出宽度等于输入宽度,这个值就是 W |sinθ|。行缓冲深度至少是这个值取整再加2,因为双线性插值需要上下两行。比如W=1920,45度时,19200.707≈1357,取整1358,加2得1360行。这个数字面试官一听就知道你是算过的,不是背的。tlast对齐的问题,其实是AXI4-Stream总线的握手信号处理。每输出一行最后一个像素时,要拉高tlast,同时保证行缓冲里的数据不会因为读指针延迟而断流。常见做法是在行缓冲写端用双缓冲,写满一行就开始读,写下一行,这样读端永远有数据。但注意双缓冲的切换时机要跟tlast同步,否则会出现一行数据被拆成两段。代码框架方面,建议分成三个模块:坐标生成(用计数器产生输出坐标)、坐标变换(CORDIC或查找表)、行缓冲与插值(双端口RAM加流水线)。资源消耗上,行缓冲用BRAM,每行存一个像素的RGB,深度就是上面算的行数。BRAM数量 = 行深度 每行像素数 / BRAM容量,通常1920×1080的图,45度旋转,BRAM大概用10-20块,具体看你位宽。最后提醒一句,面试官如果让你手写Verilog,千万别写完整的模块,写个关键的状态机或双线性插值的流水线段就够了,写太多时间不够反而扣分。你准备用哪个厂商的器件?不同厂家的BRAM容量不一样,推导行深度时要按实际器件算。

说实话,行缓冲深度这个点,很多校招帖子里只给结论不推过程,面试官就是想看你有没有真的动手算过。我建议你从输出像素的y坐标变化速率入手,别死记公式。假设输入图像宽W高H,旋转θ度,输出逐行扫描,每个输出像素的浮点坐标映射回输入图,y_in = x_out (-sinθ) + y_out cosθ。最极端的情况发生在θ=45度,此时y_in随x_out的变化斜率是 -sin45≈-0.707,也就是说每往右走一个像素,y_in就往下移约0.707行。输出一行宽度总共W个像素(假设输出尺寸和输入一致),那么这一行扫描下来,y_in的最大变化量是 W 0.707。这就意味着,要同时访问到这些像素,行缓冲至少需要覆盖这个垂直跨度,向上取整再加1到2行余量,因为双线性插值需要相邻两行,而且tlast对齐时可能因为流水线导致最后一个像素的数据还没读完。所以深度 = ceil( W |sinθ| ) + 2,45度时就是 ceil(0.707W) + 2。面试时你如果能一边画坐标变换的矩阵图,一边把这个推导口头讲清楚,比直接背结论强得多。代码框架上,建议用BRAM构建环形行缓冲,写地址由输入tvalid驱动,读地址由输出坐标经CORDIC算出的行索引控制,注意读地址要滞后写地址至少两拍以保证数据稳定。资源上,BRAM数量取决于深度×位宽,CORDIC迭代8次加一次查找表,LUT大概几百个,DSP用不上。你现在的仿真平台是用Vivado还是Modelsim?不同工具对tlast的对齐检查有差异,方便说一下你具体用的哪个版本吗?

你提到的tlast对齐才是真正容易丢帧的隐藏坑。很多校招代码只做了数据通路,忽略了AXI4-Stream要求tlast和tvalid在同一拍完成最后一个传输,且tready可能被拉低导致断流。我的做法是在行缓冲写端用计数器记录输入行数,当输出坐标映射回的行索引即将超出缓冲深度时,提前拉低tready反压上游,等缓冲腾出行空间再继续。这样虽然降低了瞬时吞吐,但保证不丢帧。深度推导方面,除了常见的45度最坏情况,还要考虑输入输出分辨率不同时的缩放因子。比如输入1920×1080输出1280×720,旋转加缩放时,y_in的变化率要乘以缩放比,深度可能减少。你现在的设计是固定角度还是任意角度?如果是任意角度,建议把角度参数化,深度取所有可能角度的最大值,或者用动态重配置行缓冲深度。

行缓冲深度这个问题,与其死记公式,不如从数据流的时间窗口去理解。你提到的CORDIC坐标变换是标准的,但真正的瓶颈不在计算精度,而在AXI4-Stream的握手协议。假设你输出一行像素,每个输出像素对应一个输入坐标 (x_in, y_in),由于旋转,y_in 会随着 x_out 变化。当旋转45度时,y_in 的变化率最大,每处理一个输出像素,y_in 大约增加0.707行。输出一行宽度为W,那么这一行扫完,y_in 最多跨越 W0.707 行。为了不丢帧,行缓冲必须能同时提供这跨行范围内的所有像素。所以深度至少是 ceil(W0.707) + 2,加2是因为双线性插值需要上下两行,且考虑tlast对齐时,最后一拍数据可能被tready拉低而断流,你需要额外一行作为冗余。实际工程里,我会再加2行作为安全余量,比如深度设为 ceil(W0.707) + 4。代码框架上,我建议用移位寄存器链实现行缓冲,而不是Block RAM FIFO,因为移位寄存器可以做到随机读取,方便插值模块同时访问多行数据。坐标变换模块用CORDIC算角度,但注意迭代次数至少8次,否则精度不够会导致插值结果出现肉眼可见的锯齿。至于tlast对齐,关键在于你的行缓冲写入逻辑要检测输入tlast,在行结束前一拍就拉低tvalid,确保当前行数据完整写入后再切换。资源消耗上,行缓冲是最大的开销,深度每增加1行,就多消耗W8比特(假设8位灰度),所以W=1920时,多一行就是15Kb,如果深度20行,光行缓冲就要300Kb,这还不包括双线性插值的乘法器。你现在的设计是固定角度还是任意角度?如果是任意角度,深度得按最坏情况45度取,或者用动态重配置减少平均资源。

个人觉得你被卡住的关键是没把坐标变换和行缓冲的因果关系打通。你算CORDIC得到输出像素对应的输入浮点坐标,这个浮点坐标的y分量随输出x变化,变化率就是 -sinθ。45度时变化率约-0.707,意味着输出一行W个像素,y_in从起始点往下跑了W0.707行。行缓冲深度必须覆盖这个跨度,否则你从缓冲区读不到需要的行,只能丢帧。所以深度 = ceil(W |sinθ|) + 2,加2是为了双线性插值需要相邻两行。面试官追问tlast对齐时,你只需要说——在行缓冲写端,检测到tlast有效时,强制拉低tvalid一个周期,确保最后一个数据落稳,再用计数器标记行结束。这样写出来的代码不乱,面试官会觉得你工程思维扎实。另外提醒一点,CORDIC的迭代次数别设太少,8次以上,否则角度误差会导致映射后的坐标偏差超过半个像素,双线性插值就白做了。你目前是用系统verilog还是纯verilog?不同写法对综合结果影响挺大的。

行缓冲深度直接取输入图像宽度乘0.707再加4,45度时基本够用。面试官其实更想听你怎么推,而不是背公式。你画个输出像素的扫描轨迹,看y_in最多跨多少行,再加上双线性插值的上下行余量和tlast对齐的额外一行,就完了。别把CORDIC迭代次数设太少,8次以上,不然坐标便宜半个像素插值结果就飘了。

面试官让你手撕,其实是想看你有没有从数据流的角度来思考,而不是只盯着算法精度。你提到CORDIC做坐标变换,这是对的,但行缓冲深度的推导关键在输出像素的y坐标变化率。比如旋转45度,输出一行W个像素,每个像素的y_in随x_out以-0.707的斜率变化,一行扫完y_in最多跑W0.707行。深度至少要ceil(W0.707)+2,加2是因为双线性插值需要相邻两行,同时tlast对齐时如果tready被拉低,最后一拍断流,你还需要一行冗余来兜底。我见过有人直接用FIFO做行缓冲,但FIFO的读写指针管理在跨行访问时容易乱,建议用双端口RAM加地址计数器,写端按输入行顺序写,读端根据映射坐标的行索引随机读。这样tlast对齐也好处理:写端检测到tlast就拉低tvalid一拍,同时清计数器,读端在行末时提前预取下一行。另外,如果旋转角度固定,你可以把CORDIC换成查找表,资源省一半,精度够用。你的设计是固定角度还是实时可变?这个会影响深度取最大值还是动态调整。

个人感觉你卡住的点不是公式,而是没把行缓冲当成一个滑动窗口来理解。旋转45度时,输出一行像素对应的y_in最多跨W0.707行,所以行缓冲深度就是那个跨度向上取整,再加2行给插值和tlast对齐。代码框架上,我建议先写一个坐标变换模块,用CORDIC算输入坐标浮点值,输出给插值模块;行缓冲用移位寄存器阵列,深度设成算好的值,写端接输入AXI4-Stream,读端根据浮点坐标的整数部分选行,小数部分做插值权重。tlast对齐就在写端计数,当检测到tlast时,把当前行数据写完后强制拉低tvalid一个周期,保证最后一个数据落稳。资源消耗上,行缓冲占BRAM最多,深度和位宽决定块数,CORDIC迭代次数影响LUT,你算一下就知道。现在你CORDIC迭代次数设了多少?
发表回答
登录后可在本页底部提交回答