2026年FPGA校招笔试题:用Verilog实现一个AXI4-Stream的实时Canny边缘检测,非极大值抑制的流水线怎么设计才能满足1080P60?

开放8 回答 60 浏览

最近在准备2026年FPGA校招,看到很多面经里都有手撕Verilog的题。我想问一下,如果让我实现一个AXI4-Stream的实时Canny边缘检测,针对1080P60的视频流,非极大值抑制(NMS)的流水线该怎么设计才能不丢帧?比如梯度方向量化成几个方向,行缓冲深度怎么算,还有边缘连接部分用硬件实现会不会太复杂?求大佬给个具体的流水线架构和资源估算,最好能带点代码框架。

分享:

8 个回答

  • 码电路的小李

    1080P60 的 NMS 流水线,核心瓶颈不在计算,在行缓冲的深度和梯度方向量化的粒度。先说方向量化:常见做法是 4 个或 8 个扇区,对于 1080P60 我个人建议用 8 扇区,虽然多一两个比较器,但能减少非极大值抑制的误判,后续边缘连接压力也小一点。行缓冲深度:Canny 的 NMS 需要 3×3 窗口,所以行缓冲至少两行(每行 1920 像素),再加上当前行输入,总共约 3×1920=5760 个像素。如果每个像素 8bit 梯度幅值,那就是 46Kbit 的 BRAM,用 Xilinx 的 BRAM18K 大概 3~4 块,非常省。但注意,梯度方向也需要同步存,所以实际 BRAM 占用会翻倍到 6~8 块。真正的流水线设计要点在于:把梯度计算、方向量化、非极大值抑制、双阈值检测这四级做成全流水,每级只延迟一行的时间。关键技巧是让方向量化模块输出一个 3bit 方向码,和梯度幅值一起打拍,这样 NMS 比较时能直接查表决定比较哪两个邻居。代码框架方面,建议先写一个参数化的行缓冲模块(shift register 实现),再写 NMS 核心比较逻辑,最后用 AXI4-Stream ready/valid 握手信号做反压。边缘连接部分用硬件实现确实复杂,校招一般不要求完全实现,能说出用双阈值检测输出二值图像、再用形态学膨胀做简单连接即可。面试官更看重你对流水线延迟和吞吐的理解。另外提醒一下,如果你是准备 2026 校招,现在就应该去 GitHub 找开源 Canny 硬件实现跑仿真,比如 ultraembedded 的 opencores 项目,能帮你快速理解时序。你目前用的开发板是什么型号?如果是 7 系列或更低端的,BRAM 资源得仔细算。

  • 新手村

    NMS 流水线就一句话:两行缓冲加一个 3×3 滑窗,方向量化为 4 个扇区(0/45/90/135),每个时钟周期比较中心像素和对应方向的两个邻域像素,保留最大值。1080P60 的像素时钟约 148.5MHz,完全够。边缘连接不用在流水线里做,输出二值图像后交给后级 CPU 或软核处理就行。校招面试手撕不会让你写完整代码,画出 pipeline 框图、说明各级 latency 即可。

  • aipowerup

    其实很多校招同学一上来就纠结边缘连接的硬件实现,但面试官更想听的是你怎么在保持流水线不 stall 的前提下把 NMS 的吞吐做够。1080P60 的像素时钟大概 148.5MHz,意味着每个时钟周期要处理一个像素。NMS 的流水线核心就两个东西:行缓冲和滑窗。行缓冲深度至少两行加当前行,也就是 19202+1920=5760 个像素,每个像素存梯度幅值和方向,按 8bit 幅值+3bit 方向算,总共 11bit,BRAM 开销大概 63Kbit,用 Xilinx 的 18K BRAM 也就 4 块。方向量化我建议 8 扇区而不是 4 扇区,虽然多两个比较器,但 1080P 下误判率低很多,后续边缘连接不用做太复杂。真正的设计要点是:梯度计算、方向量化、NMS、双阈值检测四级必须做成全流水,中间不能插 wait 信号。你可以在每个像素进入 NMS 模块时同步延迟两行的时间,等 3×3 窗口齐了再输出抑制结果。边缘连接部分面试时画个状态机说明用软核或 CPU 后处理就行,别在流水线里做,否则资源爆炸。手撕代码不要求全写,画出 pipeline 框图,标出每级 latency 和 BRAM 用量,再写个 NMS 模块的顶层接口和状态机框架就够用了。你目前对 AXI4-Stream 的 tready/tvalid 握手协议熟悉吗?如果不熟,面试时容易在行缓冲的读使能上翻车。

  • HelloGeek

    行缓冲深度就是两行加当前行,1080P 下每行 1920 像素,深度 2 够用。方向量化 4 扇区还是 8 扇区看你资源:4 扇区省比较器但边缘容易断,8 扇区多两个比较器但后续连接省事。面试官一般不会让你现场写边缘连接,说清楚用软核处理就行。写代码时注意 AXI4-Stream 的 tlast 信号用于帧同步,行缓冲用 BRAM 实现,别用寄存器堆。

  • 芯片设计新人

    你问边缘连接用硬件做会不会太复杂——我的建议是别在流水线里硬连。Canny 的边缘连接本质上是递归的连通域追踪,硬件写起来又臭又长,而且1080P60下你根本没法保证时序收敛。正确做法是NMS输出二值边缘图,然后通过AXI4-Stream的tlast信号标记帧尾,把整帧扔给片上的软核或DSP做后续连接。面试官其实更想听你知不知道这个取舍,而不是真的让你手写连接逻辑。另外方向量化建议用8扇区,虽然资源多一点点,但后续连接能少处理很多断点,省下来的调试时间比省两个比较器划算多了。你现在是已经拿到实习offer在准备转正答辩,还是纯粹为了秋招刷题?这个会影响你投入的深度。

  • FPGA萌新成长记

    很多帖子和教材都告诉你行缓冲深度是两行加当前行,算出来5760个像素,然后用BRAM实现——这些都对,但忽略了一个实际坑:你的梯度方向和幅值必须对齐到同一个行缓冲里,不然流水线跑着跑着方向就对不上像素了。以1080P60为例,像素时钟148.5MHz,你每周期要读一个像素的幅值和方向,所以行缓冲的宽度至少是幅值8bit加方向3bit,共11bit,深度1920。Xilinx的BRAM18K可以配成深度1024的18bit宽,你这每行1920深度就得用两块BRAM拼,两行就是四块,加上当前行输入的控制逻辑,总共六到八块。面试官看到你连BRAM的拼接方式都说了,基本就放心了。另外流水线结构我推荐四级:梯度计算->方向量化->非极大值抑制->双阈值检测,每一级都用valid-ready握手,避免backpressure导致丢帧。方向量化用8扇区,虽然比4扇区多两个比较器,但能减少NMS时把真正边缘误判成非边缘的概率,后续软核做边缘连接时少很多噪声。你如果现在还在学Verilog阶段,可以先在Vivado里搭一个纯仿真工程,用testbench喂1920×1080的灰度图,验证BRAM读写时序和valid信号对齐,这个比直接写Canny全流程更能帮你理解流水线瓶颈。

  • 数字电路学习者

    我建议你把梯度方向量化为8扇区,虽然多两个比较器,但1080P下边缘连续性明显好于4扇区。行缓冲深度按两行加当前行算,19202+1920=5760个像素,每个像素存幅值8bit加方向3bit,共11bit,用Xilinx BRAM18K拼接成深度1920、宽度22bit的缓冲,两块BRAM覆盖一行。NMS流水线核心是3×3滑窗比较,保证每个时钟输出一个结果就行。边缘连接别写硬件,输出二值图后交给软核处理,面试官更在意你知不知道这个取舍。

  • Verilog萌新

    对于1080P60,148.5MHz的像素时钟下NMS流水线要特别注意两点:行缓冲的读写地址同步和方向量化的扇区边界判定。行缓冲深度很多人算成5760,但实际用BRAM时你会遇到一个坑——双端口BRAM的读延迟会导致方向值和幅值错拍,所以需要额外加一级寄存器对齐,总深度其实变成了三行加三个像素。我做过一个方案是把梯度幅值和方向分别存到两块BRAM里,幅值用8bit、方向用3bit,读方向时多打一拍,流水线里加一个对齐的valid延时链。方向量化我偏向8扇区,因为4扇区在45度边界上经常把真实边缘判成非极大值,后续连接时断点太多。另外AXI4-Stream的tuser信号可以用来传帧同步,不需要额外握手逻辑,写代码时注意tlast要在帧尾拉高一个周期。校招手撕一般只让你写NMS模块的框图或伪代码,不会要求完整边缘连接,所以你把行缓冲的BRAM拼接方式和三级流水(读缓冲、滑窗比较、输出)讲清楚就足够了。你现在是刚开始准备笔试,还是已经收到面试通知在突击?这个会影响我推荐你重点看BRAM配置还是AXI时序。

登录后可在本页底部提交回答

提问者

EE学生一枚查看主页
浏览「其他」

描述场景与已尝试方案,更容易获得有效解答

相关问题

同分类

提问建议

  • 标题写清核心疑问,避免「求助」「请问」等空泛用语
  • 正文补充环境、版本、报错信息或截图
  • 先搜索本站是否已有相近问题,减少重复提问
  • 若与课程相关,请标明课时或章节便于讲师定位