最近在准备2026年FPGA校招,看到笔试题里要求用Verilog实现AXI4-Stream实时视频直方图均衡化,主要是累积分布函数(CDF)查找表的设计。我不确定怎么用BRAM来存储CDF表,而且还要处理实时流式数据,像素进来后要快速映射。有没有大佬分享过具体代码架构?比如查找表深度、位宽怎么定,以及怎么避免BRAM冲突?求详细步骤,最好有仿真波形参考。
2026年FPGA校招笔试题:手撕Verilog实现AXI4-Stream实时视频直方图均衡化,累积分布函数查找表怎么用BRAM优化?求具体代码架构
10 个回答

其实这道题在面试官眼里更看重你对 BRAM 双端口特性的理解,而不是把直方图均衡化算法用多复杂的代码写出来。CDF 查找表用 BRAM 优化,核心思路是用一个真双端口 BRAM,一个端口给写入 CDF 更新,另一个端口给实时像素查询。深度就取 256,位宽根据你需要的输出灰度级定,常见是 8 位。避免冲突的关键是错开写使能和读使能的时间窗口——比如在视频消隐期更新 CDF,这样读端口永远不会有冲突。代码架构上建议分两个状态机:一个在帧消隐期做统计和 CDF 计算并写入 BRAM,另一个在像素有效期根据输入灰度值读 BRAM 输出映射结果。仿真波形主要看读使能和写使能是否重叠,以及映射输出是否比输入延迟一两个时钟。另外有个替代做法:如果 BRAM 资源紧张,可以用单端口加寄存器旁路,不过校招题一般不会这么抠。你目前是用 Vivado 还是 Quartus 做仿真?不同工具的 BRAM 例化方式有细微差别。

我从工程角度多聊几句。你问的 CDF 查找表用 BRAM 优化,实际项目中更常见的坑是「实时更新 vs 实时查询」的矛盾。校招题往往只让你实现一帧完成一次统计、下一帧用固定 CDF 映射,但真正的视频流直方图均衡化需要逐帧或逐行更新 CDF,否则镜头切换会有滞后感。面试官可能会追问你怎么在帧消隐期内完成 CDF 计算并写入 BRAM。我的建议是:把 BRAM 配置成双端口,读端口一直给像素查询用,写端口只在消隐期使能。CDF 计算本身用加法树累加直方图,然后做个归一化除法——这里可以用一个小的查找表做除法近似,省掉除法器。具体架构上,我推荐用三段式状态机:第一段采集一帧直方图存到另一块 BRAM,第二段在帧消隐期计算 CDF 并写入目标 BRAM,第三段在下一帧像素有效时从目标 BRAM 读映射值。三个段可以流水,但注意第三段的读地址是像素值本身,所以地址位宽就是 8 位。关于避免 BRAM 冲突,除了错开读写时机,还可以利用 BRAM 的读优先或写优先模式——读优先模式下,同地址同时读写会返回旧数据,这对你的场景恰好合适,因为消隐期写 CDF 时不会有像素查询。另外位宽方面,如果你输出是 8 位灰度,CDF 最大值是像素总数,所以位宽要按最大帧分辨率来定,一般是 20 位左右。仿真时重点关注消隐期写入时序和像素有效期的读延迟是否对齐。你提到要具体代码,我建议你先拿 Xilinx 的 BRAM 原语例化手册熟悉一下端口命名,网上有很多开源项目比如 OpenCores 上的 histogram equalization 可以看,但注意那些人用的多是 2-pass 架构,和校招题的 1-pass 实时流不太一样。

BRAM 双端口,写使能只在消隐期拉高,读使能一直开,地址线直接连像素值,输出就是映射结果。代码就一个双口 RAM 例化加一个状态机,别想复杂了。仿真注意查一下读延迟是几个时钟周期,波形上对对齐就行。

说实话,校招笔试里让你手撕 AXI4-Stream 实时直方图均衡化,面试官最想看的不是你算法多花哨,而是你对 BRAM 时序和总线握手的理解到不到位。CDF 查找表用 BRAM 优化,我建议你先想清楚一个事:你是在写一帧的 CDF 还是逐行更新?校招题通常给的是帧级均衡,也就是当前帧统计完,下一帧用这个 CDF 去映射。那你的架构可以拆成两大块:一块是在帧消隐期做直方图统计和 CDF 计算,另一块是在像素有效期用查表做映射。对于 BRAM 冲突,最直接的办法是让查表端口和写表端口分时复用——查表端口在像素有效时一直开,写表端口只在消隐期写,两者永远不会同时操作同一个地址,自然就不会冲突。深度定 256 就够了,8 位灰度输入对应 256 个地址;位宽看你输出灰度级,如果输出也是 8 位,那就存 8 位 CDF 归一化后的值。代码架构上我推荐用两片 BRAM 乒乓操作:一片存当前帧的 CDF 供查表,另一片在后台写下一帧的新 CDF,帧切换时交换角色。这样你甚至不需要在消隐期抢时间写,写端口可以慢慢写一整帧的时间,查表端口永远不受干扰。仿真波形上,重点看 axi4-stream 的 tvalid 和 tready 握手对齐,以及查表输出比输入延迟了几个时钟——BRAM 读延迟一般是一个或两个周期,你要在状态机里把 tdata 和 tuser 对齐好,否则输出帧会错位。另外提醒一点,归一化除法别用除法器,用移位近似或者预计算的小查找表,不然面积和时序都难看。你目前是用 Xilinx 还是 Altera 的片子?不同厂家的 BRAM 原语写法差挺多的,我后面可以针对性地给你讲原语例化。

BRAM 双端口,写使能只在消隐期拉高,读使能一直开,地址线直接连像素值,输出就是映射结果。代码就一个双口 RAM 例化加一个状态机,别想复杂了。仿真注意查一下读延迟是几个时钟周期,波形上对对齐就行。

你问 CDF 查找表用 BRAM 优化,其实校招面试更爱问的是:你怎么确保在 AXI4-Stream 的背压(tready 拉低)情况下查表不丢数据?我建议你在查表路径上加一个 FIFO 做弹性缓冲,帧头信号 tuser 也一起同步延迟。CDF 表本身用真双端口 BRAM,读端口给查表用,写端口只在帧消隐期更新。深度 256 位宽 8 位,归一化用移位近似就行。代码架构上,我习惯把直方图统计、CDF 计算和查表映射分成三个独立的状态机,通过帧同步信号握手。这样 debug 时每个环节的波形都清晰,面试官看了也舒服。仿真波形要重点检查像素输入和映射输出之间的延迟周期数是否恒定,以及帧消隐期内写使能是否真的没和读使能重叠。还有,别忘了把 AXI4-Stream 的 tlast 信号对齐到每行末尾,不然下游模块会报错。你目前是用纯 Verilog 还是也在用 HLS?这个决定了 BRAM 例化的写法。

BRAM 双端口解法其实挺固定的:读口一直开,地址接像素值,写口只在消隐期使能。CDF 表深度256位宽8,归一化用移位近似,别整除法。代码就三个状态机,仿真重点看读延迟和写使能有没有和读重叠。你用的 Vivado 还是 Quartus?

校招笔试里这道题,我见过有人把CDF查找表的BRAM优化想得特别复杂,其实抓住两个关键点就够了:一是分时复用两个端口避免冲突,二是用近似计算代替除法器。具体来说,真双端口BRAM的读端口在像素有效期间一直工作,地址线接输入灰度值,输出就是映射后的像素值;写端口只在帧消隐期使能,利用这段时间把计算好的CDF更新进去。深度256位宽8,这是最常用的配置。归一化这一步容易出问题——直接用除法器会占用大量资源而且时序难收敛,常见做法是用一个小的ROM或者LUT存256个除法近似系数,这样映射过程就变成了两次查表:一次查CDF,一次查归一化系数,然后做个乘法。但这里有个坑:如果帧率要求高,消隐期可能不够你完成256次CDF写入。我的替代方案是采用乒乓BRAM结构——两个BRAM轮流做读表和写表,当前帧用BRAM_A做查表映射,同时用BRAM_B更新下一帧的CDF,下一帧交换角色。这样读写完全并行,没有时间窗口限制。仿真波形上,重点看三处:tready拉低时数据是否保持、读延迟周期数是否固定、以及tlast信号是否正确对齐行结尾。你现在的时钟频率大概多少?如果超过200MHz,BRAM的读延迟可能会影响流水线设计,得做一级寄存器打拍。顺便提一句,有些面试官会追问如果输入是10位灰度(1024级)怎么改,你提前想好深度和位宽的调整方案会加分不少。

这道题面试官真正想看的其实不是直方图均衡化算法本身,而是你对AXI4-Stream握手和BRAM双端口时序的工程理解。我的建议是别把CDF查找表当成一个孤立模块,而要把它嵌入到帧同步信号里。具体做法:用一个双端口BRAM,读端口地址直接连输入像素值,输出就是映射结果,读使能一直拉高;写端口只在帧消隐期使能,写入计算好的CDF值。这样读写永远错开,不存在冲突。深度定256(对应8位灰度),位宽8位足够。归一化可以用一个小的ROM存除法近似系数,省掉硬件除法器。代码结构上,我习惯把直方图统计、CDF计算、查表映射拆成三个独立状态机,通过帧同步信号握手。这样调试时每个环节的波形都清晰。仿真要特别注意检查读延迟是几个时钟周期(BRAM一般是1-2个周期),以及消隐期内写使能是否真的没和读使能重叠。你目前是只做帧级均衡还是需要逐行更新CDF?这个会影响架构复杂度。

其实这道题有个容易被忽视的点:BRAM读延迟会破坏像素流和CDF映射值之间的对齐关系。你查表输出比输入晚一个或两个时钟周期,而AXI4-Stream的valid/ready握手要求数据必须和tuser、tlast这些侧信道信号严格对齐。我见过有人写完代码仿真发现映射结果和原始像素错位了一整行,就是因为没处理读延迟。解决方案很简单:在查表路径上加一个同样深度、同样延迟周期的FIFO或者移位寄存器链,把像素的同步信号(tuser、tlast)也打拍相同的次数。这样映射数据和控制信号就能对齐输出。至于BRAM本身,深度256位宽8是标配,真双端口配置,读端口连像素值地址并一直使能,写端口只在帧消隐期更新CDF。归一化用移位加一个小的ROM存余数修正系数,比纯除法省资源。代码架构上我习惯把直方图统计、CDF计算、查表映射拆成三个独立状态机,通过帧起始信号tuser来同步各模块的启动和结束。这样调试时每段波形都清晰,面试官也容易看懂你的思路。你目前是用Vivado还是Quartus?不同工具对BRAM的读延迟配置选项不太一样,会影响你打拍级数的选择。
发表回答
登录后可在本页底部提交回答