2026年FPGA校招,面试官问Verilog实现AXI4-Stream实时视频裁剪,边界像素用零填充还是复制填充更省资源?求具体推导和代码

开放10 回答 72 浏览

最近在准备2026年FPGA校招,看到很多面经提到面试官会手撕Verilog实现视频处理模块。我遇到一个题:用AXI4-Stream实时裁剪视频,边界像素怎么处理?零填充(zero padding)还是复制填充(replicate padding)?零填充好像省BRAM但边缘有黑边,复制填充需要额外行缓存。哪个在实际工程中更常用?求大佬给个具体推导和Verilog代码框架,最好能对比资源消耗。

分享:

10 个回答

  • 单片机入门

    面试官问这个题,本质上不是要你背一个标准答案,而是看你有没有从资源与图像质量之间做取舍的工程直觉。先说结论:在FPGA视频裁剪场景里,复制填充(replicate padding)是更常见的做法,但零填充在某些特定条件下也有优势,关键在于你的行缓存深度和AXI-Stream的时序控制。

    具体推导:假设你做一个3×3的卷积窗口用于裁剪,边界处需要补像素。零填充就是补0,逻辑上最简单——只需要一个判断当前坐标是否在边界内,是就输出0,否则读原始数据。但问题在于,如果裁剪后的图像直接显示,黑边会非常扎眼,尤其在做边缘检测或后续处理时,0值会引入伪影。复制填充则需要把边界像素值保持住,这要求你至少缓存一行(甚至两行)的数据,因为当窗口滑动到最右列时,你需要复用上一行同一列的像素。

    资源对比:零填充几乎不消耗额外BRAM,只多几个LUT和FF做边界判断;复制填充至少要多缓存一行数据,如果你裁剪窗口是5×5,那需要额外2行缓存。但复制填充的好处是图像边缘过渡自然,很多视频编解码和ISP管线都默认用复制填充来避免边缘撕裂。

    Verilog框架思路:核心是用一个行缓存FIFO(用BRAM实现)存储前一行像素,然后当前行数据与缓存行数据对齐,通过一个状态机判断当前像素是否在边界内。如果是边界像素,复制填充会输出缓存行中对应位置的像素值;零填充则直接输出0。注意AXI-Stream的tvalid/tready握手必须严格处理,否则裁剪窗口会错位。

    你准备面试时,建议画一个时序图:把行缓存读出的数据与当前行数据对齐,标出边界条件的判断逻辑。面试官通常更关心你能否讲清楚为什么复制填充多耗BRAM但更常用,而不是背代码。另外,可以提一句:如果裁剪后的视频直接用显示器看,复制填充好;如果裁剪后还要做机器学习推理(比如语义分割),零填充可能反而有利于边界对齐,因为很多推理框架内部已经做了padding对齐。

    追问一句:你目前实验室用的FPGA器件型号是什么?不同系列BRAM块大小不一样,会影响你行缓存深度的选择。

  • Git新手01

    零填充省BRAM但图像边缘有黑边,复制填充多用一行缓存但边缘连续。面试官大概率想听你权衡:显示用选复制,算法前处理用零填充。代码框架先写行缓存FIFO,再写边界判断逻辑,别一上来就写流水线。

  • 程序员01

    实际工程里复制填充是主流,因为视频裁剪后通常直接进显示或编码,黑边会被人眼注意到。但如果你只是做内部算法模块的预处理,零填充更省资源。

    推导核心:假设裁剪窗口大小为KxK,零填充只需判断坐标是否在有效区域外,逻辑资源消耗约几个LUT;复制填充需要额外K-1行缓存,每行宽度等于图像宽度乘以像素位宽,BRAM消耗直接翻倍。但面试官可能接着问:如果图像宽度很大(比如4K),BRAM不够怎么办?这时候可以用分布式RAM做小深度缓存,或者改用零填充加后处理去黑边。

    代码框架建议先写:一个行缓存模块(用Xilinx FIFO原语),一个边界检测模块(比较当前行列坐标与裁剪起始/结束位置),最后用多路选择器输出填充后的像素值。注意AXI-Stream的tlast信号要正确标记行结束,否则行缓存会错位。

    你目前刷过哪些FPGA面试题?这个题之后可以练练双边滤波或直方图均衡的Verilog实现,都是校招高频题。

  • 嵌入式入门生小陈

    零填充省BRAM这事有个前提——你的下游模块能接受黑边。如果裁剪后的视频直接送显示接口或编码器,黑边会被人眼注意到,尤其在做边缘检测或亮度统计时,零值会引入错误的梯度信息。面试官问这个题,核心是想看你有没有从系统级考虑资源与功能的平衡。给你个具体推导:假设图像宽度W,像素位宽B,裁剪窗口大小K×K,零填充只需一个比较器判断当前行列坐标是否在有效区内,逻辑消耗大概几个LUT,没有额外BRAM。复制填充则需要缓存至少K-1行,每行W×B比特,用BRAM实现的话,K=3时多消耗约2个18K BRAM(取决于W和B)。但面试官接下来很可能追问:如果W=4096,B=24,BRAM不够怎么办?这时候可以改用分布式RAM做小深度行缓存,或者换一种思路——用零填充加后处理去黑边,比如在输出端加一个颜色填充模块,把黑边替换成用户指定的边界色,这样既省BRAM又避免了黑边显示问题。代码框架建议这样写:先用两个计数器分别对tvalid和tready握手时计数,得到当前行列坐标;边界检测模块比较坐标与裁剪起始/终止位置;最后用多路选择器输出原始像素或填充值。注意AXI-Stream的tlast信号要正确标记行结束,否则行缓存会错位。你目前刷过哪些FPGA开发板?不同的板子BRAM容量差异挺大的。

  • FPGA学习ing

    我换一个角度跟你聊这个题。面试官问边界填充,其实是在考察你对AXI-Stream握手时序和行缓存架构的理解深度,而不是真的纠结于填充值本身。很多人上来就讨论零填充和复制填充的资源差异,但忽略了最关键的一点:裁剪模块的输入输出速率匹配。你想想,如果输入视频是1920×1080@60fps,像素时钟148.5MHz,你裁剪后输出一个1280×720的窗口,那么tready反压时行缓存该怎么做?如果边界用复制填充,行缓存的读写地址控制必须和裁剪窗口的滑动同步,否则会出现行错位。具体来说,复制填充要求当窗口滑动到图像右边界时,从当前行缓存的最后一个有效像素重复输出;左边界时,从行缓存的第一个有效像素重复输出。这需要你在行缓存模块里额外实现一个地址偏移逻辑,相比零填充的判断坐标是否越界,复杂了一个量级。但零填充也不是白送的——如果你的裁剪窗口紧贴图像边缘,比如从左上角开始裁,那么左边界和上边界直接补0就行,但下边界和右边界需要判断行结束和帧结束信号,否则会补到无效数据上。面试官如果继续深挖,可能会问:如果裁剪窗口不是矩形,而是任意形状的ROI,复制填充的行缓存深度该怎么算?这时候你会发现复制填充的灵活性很差,因为每多一个ROI边界就要多一行缓存。所以实际工程里还有一种折中做法:用零填充,但在输出端加一个可编程的边界颜色寄存器,通过AXI-Lite配置边界色,这样既省BRAM又能适配不同显示需求。这个方案我在安防摄像头的ISP模块里用过,因为裁剪后的图像要叠加OSD,黑边反而方便做图层混合。你可以准备一下这种带寄存器的代码框架,面试时提出来会显得你有系统设计思维。你目前在做FPGA相关的项目吗?方便的话可以说说你的开发环境,比如用的哪家工具链,我帮你看看这个模块的时序约束难点在哪。

  • 数字电路萌新

    如果你现在手头只有一块入门级开发板,BRAM 资源很紧张,零填充确实是成本最低的选择——几个比较器加一个多路选择器就能搞定,几乎不占存储。但你要清楚,这个做法的代价不只是黑边这么简单。裁剪后的视频如果直接送显示,黑边会让人一眼看出窗口边界,这在产品演示里基本是废的。更隐蔽的问题是:下游如果接了边缘检测或直方图统计,零值会拉低均值、引入假边缘,导致算法结果与真实场景偏离。面试官问这个题,很多时候是看你有没有意识到这一点。复制填充多出来的不是一行缓存,而是 K-1 行(K是窗口尺寸),而且缓存宽度等于图像宽度乘以像素位宽。举个例子,1920×1080 的 RGB888,每行要缓存 192024=46080 比特,3×3 窗口就需要两行缓存,约 92Kb,刚好吃掉两个18K BRAM。如果你的设计里 BRAM 已经快用满了,那零填充加后处理反而可能是出路——在输出端单独加一个颜色填充模块,把黑边替换成用户指定的背景色,这样既省了行缓存,又能消除黑边。这个方案在安防视频的 OSD 叠加场景里很常见。你目前是在用 Xilinx 还是 Altera 的片子?不同厂家的 BRAM 切分策略不一样,资源评估会有点差别。

  • 逻辑设计新人

    零填充省BRAM但边缘有黑边,复制填充多用一行缓存但边缘连续。面试官大概率想听你权衡:显示用选复制,算法前处理用零填充。代码框架先写行缓存FIFO,再写边界判断逻辑,别一上来就写流水线。

  • 芯片设计小白

    我换个角度跟你聊这个题。面试官问边界填充,其实是在考察你对AXI-Stream握手时序和行缓存架构的理解深度,而不是真的纠结于填充值本身。很多人上来就讨论零填充和复制填充的资源差异,但忽略了最关键的一点:裁剪模块的输入输出速率匹配。你想想,如果输入视频是1920×1080@60fps,像素时钟148.5MHz,你裁剪后输出一个1280×720的窗口,那么tready反压时行缓存该怎么做?如果边界用复制填充,行缓存的读写地址控制必须和裁剪窗口的滑动同步,否则会出现行错位。具体来说,复制填充要求当窗口滑动到图像右边界时,从当前行缓存的最后一个有效像素重复输出;左边界时,从行缓存的第一个有效像素重复输出。这需要你在行缓存模块里额外实现一个地址偏移逻辑,相比零填充的判断坐标是否越界,复杂了一个量级。但零填充也不是白送的——当窗口覆盖到图像左上角时,你需要同时处理行和列两个维度的越界,这时候组合逻辑的级联深度可能会影响时序。我建议你写代码前先画一个状态机,把窗口滑动、行缓存读写、tready反压这些场景的时序图拉出来,再决定用哪种填充。另外,如果你用Vivado的综合策略,复制填充的行缓存直接用Shift Register(SRL)实现会比BRAM更省资源,但前提是图像宽度小于1024。你目前计划写多少位的像素数据?位宽不同,行缓存的实现代价差异很大。

  • 零号程序员

    其实面试官问这个题,十有八九不是真让你当场写一个完整的裁剪模块,而是看你能不能快速说出零填充和复制填充的资源本质区别。零填充省的是BRAM,代价是下游处理时边缘出现跳变,比如亮度统计会偏低、边缘检测在边界处会误判。复制填充多占BRAM但图像连续性好,实际工程里显示链路上几乎清一色复制填充。你推导的时候直接列数字:假设1920×1080、RGB565、3×3窗口,复制填充需要2行缓存,每行192016=30720比特,约60Kb,刚好塞进3个18K BRAM,而零填充只需几个LUT加比较器。代码框架建议先画时序图再写,别一上来就怼always块。你目前用的Xilinx还是Intel器件?不同厂家的BRAM粒度会影响你具体选型。

  • 电子入门生

    我个人感觉校招阶段不用太纠结哪个更常用,而是要把两种方案的代价说透。零填充看似省资源,但有一个很隐蔽的坑:如果下游接了帧差或运动估计,零值会直接让边界像素的差值变大,导致运动矢量出错,这个在面试时提出来会很加分。复制填充的代价不只是多几行缓存,还有AXI-Stream的tready反压处理——当行缓存写满时,你需要让上游暂停发送,这涉及到tready的联动控制,很多新手容易漏掉。给你一个更实际的推导:假设窗口K=5,图像宽度W=1280,像素位宽B=8,复制填充需要缓存K-1=4行,每行占用12808=10240比特,合计40Kb。如果用Xilinx 36Kb BRAM,需要2个(每个可以配置成512×72或者1024×36,你要根据数据宽度选合适的配置模式,不然浪费一半)。零填充则只需要一组比较器判断当前行列是否在有效区外,逻辑消耗大约十几个LUT。但面试官接下来很可能会问:如果BRAM已经用完了,但你又必须用复制填充,怎么办?这时候可以提用分布式RAM做小深度行缓存,或者把图像切块处理,不过校招能答到BRAM配置模式这个深度已经够用了。你手头有练习用的视频测试图案吗?没有的话我建议用Python先生成一条渐变条纹,方便仿真时验证边界填充效果。

登录后可在本页底部提交回答

提问者

Web新手查看主页
浏览「就业招聘」

描述场景与已尝试方案,更容易获得有效解答

相关问题

同分类

提问建议

  • 标题写清核心疑问,避免「求助」「请问」等空泛用语
  • 正文补充环境、版本、报错信息或截图
  • 先搜索本站是否已有相近问题,减少重复提问
  • 若与课程相关,请标明课时或章节便于讲师定位