今天面了海思,面试官让手撕一个AXI4-Stream接口的实时直方图均衡化模块。我知道累积分布函数(CDF)的计算需要统计整帧像素,但实时流式处理时怎么用流水线计算CDF才能保证不丢帧?用双BRAM乒乓操作还是用FIFO缓存?求具体推导和代码框架,最好能给出资源估算对比。
2026年FPGA校招,面试官问手撕Verilog实现AXI4-Stream实时直方图均衡化,累积分布函数怎么用流水线计算才能不丢帧且资源最省?
8 个回答

说实话,面试官问这个题,重点不是让你当场写出完整可综合的CDF流水线代码,而是考察你对实时图像处理中数据流与控制流的理解。我的建议是:别一上来就想双BRAM乒乓,先理清帧边界。直方图均衡化本质是帧级算法,你要在帧消隐期完成统计和CDF计算,否则必然丢帧。流水线思路可以是:第一级用单BRAM做像素计数,第二级在帧结束瞬间用组合逻辑或简单加法器树累加出CDF,第三级用另一个BRAM存储查找表,下一帧像素直接查表输出。这样只需要两块BRAM(一块计数、一块查表),不用乒乓,面积比双BRAM乒乓省一半。但有个前提——你得知道帧有效信号(tlast)何时到来,并且预留至少一行像素的时间做CDF累加。如果面试官追问实时性,你可以说用两帧交替处理,即当前帧查上一帧的CDF,这样流水线深度为两帧,延迟固定,不丢帧。常见误区是试图在像素流中做增量CDF累积,那会导致同一个像素被重复统计,结果全乱。追问一句:你这边面试时有没有规定输入分辨率?不同分辨率对BRAM深度要求差很多,比如1080p和4K,CDF累加器的位宽和时序余量完全不一样。

双BRAM乒乓是标准答案,但面试官更想听你说出为什么不能只用单个FIFO。单个FIFO没法同时做读旧CDF和写新统计,会冲突。一句话:用两个BRAM交替写读,帧头切换,搞定。

这道题其实是个经典的两帧流水线设计,核心矛盾在于:直方图统计必须等整帧收完才能计算CDF,但AXI4-Stream是连续流,你不能让数据停住。所以第一件事是确认面试官允许的延迟——通常可以接受1到2帧的延迟,因为直方图均衡化本身就不要求零延迟。基于这个前提,最省资源的做法不是双BRAM乒乓,而是单BRAM加一个累加器,配合帧同步控制。具体来说:你用一个BRAM(深度等于灰度级数,比如256x8bit)做像素计数,每个时钟周期进来一个像素,读旧值加1写回。帧结束(tlast有效)后,你用一个组合逻辑加法器树或者单周期累加器,在消隐期内把BRAM里的所有计数值读出来,边读边累加,得到CDF,同时归一化到输出范围(比如0-255)。这个CDF可以直接写回同一个BRAM,覆盖原来的计数值,这样BRAM就变成了查找表。下一帧像素来的时候,直接用像素值作为地址读BRAM,输出就是均衡化后的结果。这样只用了1块BRAM,比双BRAM乒乓省一半资源,但代价是消隐期必须足够长,能容纳256个读操作和256个写操作。对于1080p60来说,消隐期大概有几百个时钟周期,够用;但如果分辨率特别高或者帧率特别低,就要考虑用双端口BRAM并行读写来加速。另外,面试官可能还会问累积分布函数怎么归一化——别忘了CDF最大值是总像素数,你要用乘法器做缩放,而不是除法器,除法器太费资源。一般做法是把总像素数取倒数存成定点数,然后用乘法器乘CDF值,结果截位。这个乘法器可以复用,因为归一化只在帧消隐期做一次。最后提一个工程细节:AXI4-Stream的tready信号必须正确处理,否则背压会导致丢帧。你要在BRAM写端口准备好时拉低tready,等消隐期结束再拉高。如果面试官追问时序收敛问题,你可以说把BRAM输出寄存器打一拍,累加器用流水线加法器树,这样频率能跑到300MHz以上。整体资源估算:1块BRAM36K(够256x8bit),1个乘法器,1个加法器树(约8个LUT),控制状态机几十个LUT,对于现代FPGA来说非常小。追问:你面试时他有没有指定灰度级数?如果是12位RAW图,BRAM深度要4096,面积翻四倍,控制逻辑也要改。

说实话,你遇到的这个问题,核心不在于双BRAM还是单BRAM,而在于你能否把帧同步信号和流水线延迟解耦。海思面试官真正想听的是你对AXI4-Stream协议中tuser或tlast的运用,而不是死记硬背乒乓结构。我建议你换个思路:别在像素流里硬算CDF,而是用两帧流水——当前帧进来时,你只做像素计数,用一个BRAM(256深度x8位宽)存每个灰度出现的次数;帧结束瞬间,你利用消隐期(一般至少几十行像素时间)用一个累加器把计数BRAM遍历一遍,边读边累加出CDF,然后直接改写成查找表,存入同一个BRAM。下一帧的像素进来时,直接查这个BRAM输出均衡后的值。这样你只需要一块BRAM加一个累加器,面积比双BRAM乒乓省一半,而且不丢帧。但有个前提:你的消隐期必须足够完成256次累加,一般1920×1080@60Hz的消隐期是几十微秒,256个时钟周期绰绰有余。如果面试官追问更极端的场景比如超高清或低延迟要求,你可以说再加一块BRAM做双缓冲,A帧统计时B帧查表,交替使用。这样资源是两块BRAM,但比乒乓操作少了一半控制逻辑。常见误区是很多人把CDF计算和像素流串在一起,非要等整帧统计完才输出,结果要么丢帧要么用FIFO缓存整帧数据导致BRAM爆炸。记住,直方图均衡化天生就是帧级算法,必须接受至少一帧延迟。追问一句:你用的AXI4-Stream接口里,tuser信号有没有帧起始标志?这个细节决定了你的帧同步设计能不能简化。

双BRAM乒乓是典型解法,但面试官其实更在意你懂不懂为什么要乒乓。简单说:一个BRAM在写当前帧的像素计数时,另一个BRAM在输出上一帧算好的CDF查找表,帧头切换角色。这样不丢帧,但代价是两倍BRAM。如果你能接受一帧延迟,用单BRAM加累加器在消隐期做CDF更省资源。别被FIFO带偏,FIFO在这里没用,因为直方图需要随机读写,FIFO只有顺序存取。你如果手撕代码,重点写清楚帧结束信号触发累加状态机,以及查找表更新的时序控制。面试时能画个状态转移图就稳了。

单BRAM加帧结束累加就行,消隐期够你算256次加法。双BRAM乒乓是教科书答案,但资源翻倍。面试官要是问你为啥不乒乓,你就说消隐期足够,省一块BRAM给其他模块用。追问:你的tlast信号怎么对齐帧边界?

面试官问这个其实是想看你对帧边界和流水线延迟的理解。别一上来就双BRAM乒乓,你先说清能用单BRAM加累加器在消隐期算CDF,省一块BRAM的同时还省了切换逻辑,如果面试官追问实时性,再提两帧交替处理。你写代码时tlast信号怎么对齐的?

个人感觉你有点被双BRAM乒乓这个标准答案框住了。海思面试官更想听的是你能否在资源与实时性之间做工程取舍,而不是死记硬背结构。一个常见的省资源做法是:用一个BRAM做像素计数,帧结束(tlast有效)后,利用消隐期(通常几百到几千个时钟周期)顺序读出计数值,边读边用累加器算出CDF,然后直接覆盖回同一个BRAM作为查找表。这样下一帧的像素进来时直接查表输出,只需要一块BRAM加一个加法器,面积比双BRAM乒乓省一半。代价是消隐期必须足够完成256次累加,1080p@60Hz的消隐期一般是够的,但如果你做4K@120Hz就要重新算。另外别忘了归一化,CDF最大值要映射到255,可以用乘法器加移位实现。你面试时画个帧同步状态机,把计数、累加、查表三个阶段分开,面试官应该就满意了。追问:你当前的目标分辨率是多少?这个直接决定消隐期是否够用。
发表回答
登录后可在本页底部提交回答