2026年FPGA校招,面试官让我手撕Verilog实现AXI4-Stream实时直方图均衡化,BRAM和DSP怎么分配才不爆?比如输入1920×1080,目标帧率60fps,求具体代码框架和资源对比。
2026年FPGA校招,手撕Verilog实现AXI4-Stream实时直方图均衡化,BRAM和DSP怎么分配才不爆?求具体代码框架
11 个回答

说实话,应届生能把直方图均衡化在FPGA上跑通AXI4-Stream已经不容易,面试官问BRAM和DSP分配,其实是在看你有没有意识到这个算法的资源瓶颈在哪。直方图均衡化本质分两步:统计像素分布和生成映射表,难点在于实时流式处理——你不能先存一帧再算,那样BRAM就炸了。常见做法是用双缓冲BRAM做统计,比如1920×1080@60fps,一行时间大概15.3微秒,你需要在行消隐期完成累积分布函数计算,所以BRAM至少要两片:一片存当前帧行的统计结果,另一片给上一帧的映射表。深度上,8位灰度图只需要256个地址,宽度16位够计数(19201080=2M,2^21,所以21位更保险),这样单块BRAM只用1个18Kb块。DSP主要花在映射表生成时的除法或查表加速,如果你用查找表代替除法,DSP可以省到0,但BRAM要多一块存归一化系数。关键坑在于:很多人想用流水线结构,每来一个像素就更新直方图,这会导致BRAM读写冲突,必须设计成垂直消隐期更新、有效数据期间只读映射表。代码框架上,建议状态机分三态:IDLE等待帧开始,HIST在每行有效像素时写统计BRAM,MAPPING在行消隐期做累积和并写映射表BRAM,然后下一个帧读映射表输出。资源估算:三块18Kb BRAM(统计、映射、暂存),0个DSP如果全用BRAM查表,或者1个DSP做除法。面试官如果追问更极限的情况,比如10位深度,你就得考虑用分布式RAM或Block RAM拆分,但校招能答到这程度已经够了。你目前是在准备机试还是面试追问?如果机试,建议先把单帧的仿真调通,面试官更看重你对资源冲突的理解而不是代码完美。

面试官问BRAM和DSP分配,其实是想看你会不会算资源。1920×1080@60fps,一帧大概207万像素,8位灰度直方图需要256个计数器,每个宽度21位,所以BRAM深度256、宽度21,一块18Kb BRAM就够了。但实时处理必须双缓冲,所以至少两块:一块存当前帧统计,一块存上一帧映射表。DSP如果做除法,需要1个,但更省资源的方法是直接用查找表,把累积值左移20位后当地址查预存的归一化系数,这样0 DSP。代码框架核心就是状态机:帧消隐期做统计,行消隐期算映射,有效像素只读映射表输出。注意别在统计BRAM和映射BRAM之间搞混读写使能就行。

BRAM分统计和映射两块,DSP能省就省,用查表代替除法。面试官问这个主要是看你会不会算256深度的BRAM数量,别答成存整帧图像就行。

看到你在准备校招,正好我去年带过几个实习生面试,这个题很典型。先说资源分配,核心误区是有人一上来就想存整帧图像,那BRAM肯定爆——1920×1080的灰度图大概2MB,一块BRAM才18Kb或36Kb,根本不可能。正确思路是用行缓存加双缓冲,每行存256个计数器,宽度21位就够了,这样BRAM只占2块左右,一块做统计、一块做映射表,行消隐期切换角色。DSP方面,直方图均衡化需要算累积分布再除总像素数,除法器很贵,但你可以用查找表代替:预先把归一化的系数存进ROM,每次用累积值查表输出,这样DSP占用降到0。代码框架上,状态机分三段:帧消隐期初始化计数器,行有效期统计各灰度值出现次数,行消隐期做累加并更新映射表。注意读写使能别搞混,统计BRAM在行有效时写、行消隐时读,映射BRAM反过来。一个小风险是:如果面试官追问为什么不用单BRAM做乒乓操作,你要能说出双缓冲能避免映射表和统计结果冲突,且面积只多一块而已。另外,你目前对AXI4-Stream的握手机制熟悉吗?比如tready和tvalid的配合,在统计阶段如果数据流被反压,计数器更新逻辑怎么处理?

其实面试官就是想听你算一笔账:256个21位计数器正好塞进一块18Kb BRAM,两块做乒乓,DSP用查找表替代,0 DSP。代码框架无非三个状态机,别把问题想复杂了。

这个题我面过不同公司的人,发现一个有意思的分水岭:大多数应届生能说出双缓冲BRAM和查表代替除法,但很少人真正意识到实时直方图均衡化里最大的瓶颈不是BRAM大小,而是行消隐期的计算延迟。给你算笔细账吧。1920×1080@60fps,一行有效像素1920个,行消隐期大概280个像素时钟(按148.5MHz的像素时钟算),也就是不到2微秒。在这段时间里,你必须读完当前行的256个计数器、做完累加、算出映射表并写回另一块BRAM。如果直接用除法器,一个除法通常要几十个周期,两微秒根本不够,所以必须用查找表或流水线除法。查找表怎么做?提前把 1/总像素数 这个常数拆成2的幂次组合,比如 1/2073600 约等于 2^(-21) 的近似值,然后对累积值左移固定位数后查ROM,这样2微秒内能出结果。另一个容易被忽略的点是AXI4-Stream的握手机制:统计阶段如果上游tvalid和tready握手成功,你要保证每个像素到来时对应的计数器加1,但如果tready拉低导致数据暂停,计数器不能错位。常见做法是用一个写使能信号与tvalid和tready的与逻辑绑定,同时统计BRAM的写地址用像素值本身,这样无需额外地址累加器。关于BRAM分配,我推荐用3块而非2块:一块做当前帧行统计(读写双端口,一个口写计数器,一个口读累加),一块做上一帧的映射表(只读供输出),第三块做映射表更新缓冲区(在行消隐期写入新映射,下帧切换角色)。这样读写冲突完全消除,时序更容易收敛,代价只是多一块18Kb BRAM,对于7系列器件来说几乎没影响。最后说回面试,如果你能在白板上画出三个BRAM的角色转换时序图,并标出行消隐期的计算窗口边界,面试官基本就会点头了。你目前在练习时用的是哪种开发板?如果是Zynq系列,建议把AXI4-Stream的TUSER信号也利用起来,用它标记帧起始,这样状态机更简洁。

其实面试官主要想听你意识到一件事:实时处理的关键是行级流水而不是帧级缓存。1920×1080@60fps,一帧有1125行(含消隐),每行周期大概2200个像素时钟,其中有效像素1920个。直方图统计必须逐行做,用一块BRAM存256个21位计数器,行有效时写,行消隐时读出累加生成映射表,同时另一块BRAM存上一帧的映射表供当前行查询。这样BRAM只用两块18Kb,DSP用查表法替代除法——把1/总像素数拆成2的幂次近似,对累积值移位后查ROM,零DSP。代码框架就是三个状态机:帧起始清计数器、行有效统计、行消隐更新映射。注意读写使能别竞争就行。你目前是用Vivado还是Quartus?不同工具对BRAM推断有细微差别。

我去年带实习时发现很多人栽在行消隐期时序上,而不是资源分配本身。BRAM和DSP的分配其实网上能搜到固定答案:256深度21位宽,两块18Kb BRAM做乒乓,查找表代替除法,0 DSP。但面试官真正想看你有没有想过——行消隐期只有280个时钟周期(按148.5MHz算),你要在这点时间内完成256个累积值的累加、查表生成映射并写回BRAM。如果直接用for循环顺序累加,256次加法加一次除法,时间根本不够。常见做法是把累加做成流水线,每拍更新一个地址的累积值,同时把除法的分母预先计算好,用移位加查表。代码框架上,我建议把状态机拆成四级流水:读当前计数器、累加、查表、写映射BRAM。一个小风险是累加器宽度要21位,不然统计2M像素时会溢出。你面试时如果被追问时序约束,能说出行消隐期的具体时钟数吗?

聊点不一样的。很多人一上来就盯着BRAM和DSP的数字,但我觉得这道题真正的坑在于你对AXI4-Stream协议的理解深度。面试官让你手撕Verilog实现实时直方图均衡化,他其实想听三件事:第一,你会不会处理TREADY和TVALID的握手反压;第二,你知不知道行消隐期和帧消隐期在Stream里对应什么信号;第三,你清不清楚乒乓BRAM的切换时机不能丢像素。举例来说,输入tdata是8位灰度值,tvalid和tready握手成功后你才采样。统计阶段,每个像素的灰度值作为地址去写BRAM,但BRAM读写出时序差一拍,所以需要把tvalid延迟一拍匹配地址。更隐蔽的是帧消隐期——当tuser(帧起始)拉高时,你要立刻切换映射BRAM的角色,否则下一帧开头几个像素用的还是旧映射表,画面会闪。资源分配上,我倾向于用三块BRAM:两块做统计乒乓,一块做映射表只读,这样逻辑更干净,虽然多占一块但时序好收敛。DSP方面,如果你用Xilinx 7系列,其实可以用DSP48E1做一次乘加替代除法——把总像素数的倒数事先算好存成定点数,每次累积值乘这个定点数再右移,一个DSP就够了,时序比查表更快。你如果还想省,可以试试用LUTRAM代替BRAM统计,但深度256的话LUTRAM要256×21=5376个LUT,中端FPGA可能扛不住。说到底,这道题考的是你在资源、时序、协议理解之间的取舍。你目前手上有开发板可以实际跑一下吗?我建议用Vivado的IP Integrator搭个测试bench,重点看行消隐期波形和握手信号是否完整。

其实这道题面试官想看的不是你会不会算BRAM深度,而是你知不知道行消隐期那几百个时钟里怎么把256个累加值算完。资源分配网上都能搜到,关键是你有没有想过用流水线累加器代替for循环。
发表回答
登录后可在本页底部提交回答