在准备2026年FPGA秋招,海思面试官让我手撕Verilog实现AXI4-Stream实时视频缩放,双线性插值的行缓冲深度到底怎么算?比如输入1920×1080,输出1280×720,缩放比例0.666,行缓冲需要几行?公式是什么?求具体推导步骤和代码框架,最好能给出Verilog模块接口定义和流水线设计思路,谢谢!
2026年FPGA秋招,海思面试官让我手撕Verilog实现AXI4-Stream实时视频缩放,双线性插值行缓冲深度怎么算?求具体推导和代码框架
12 个回答

行缓冲深度这个问题,面试官其实不是要你背公式,而是看你能不能从「数据依赖」和「流水线节拍」两个角度推导出来。先说结论:双线性插值需要 2 行缓冲就够了,但前提是你按「当前行 + 上一行」的滑动窗口方式处理。推导过程:假设缩放比例是 0.666,输入 1920 宽,输出 1280 宽,意味着每输出一个像素,输入坐标会移动约 1.5 个像素。双线性插值需要取最近的 2×2 邻域,也就是你需要同时拥有当前行和上一行的像素值。行缓冲的深度 = 输入图像一行像素的宽度(1920),乘以需要的行数(2),再考虑位宽(比如每个像素 8bit RGB 就是 24bit)。但注意:实际工程中,为了应对 AXI4-Stream 的 backpressure 和行首对齐,通常会把缓冲深度设为 2 行 + 几个像素的 FIFO 余量,避免跨行时丢数据。常见误区是有人以为需要 3 行甚至 4 行,那是把双线性插值和双三次插值搞混了。代码框架上,模块接口可以这样定义:input clk, rst_n, input s_axis_tvalid, s_axis_tlast, s_axis_tdata[23:0], output s_axis_tready, 然后内部例化两个 line_buffer(用 Xilinx 的 BRAM 或者分布式 RAM 实现),每个深度 1920,用双端口 RAM 同时读写。流水线设计分三步:第一步,写使能控制写入当前行;第二步,读使能控制读出相邻两行同一列的数据;第三步,根据小数坐标计算加权和,输出 tvalid。这里有个工程取舍:如果你用 Vivado 的 IP 核,比如 Video Processing Subsystem,它会自动管理行缓冲,但面试手撕的话,最好自己写一个简单的 shift register 链,用 $readmemh 预先写入测试数据来仿真验证。另外,缩放比例不是整数时,坐标生成器要用 Bresenham 算法或者累加器方式,避免除法器。你目前是在用哪家的开发板做验证?如果还没选,建议先拿 Zynq 的 HLS 写个原型,再转纯 Verilog,这样面试时能讲清楚 HLS 和 RTL 的 tradeoff。

其实推导核心就一句话:双线性插值需要同时访问两行数据,所以行缓冲深度等于输入图像一行像素数乘 2。但面试时容易漏掉一个细节:当缩放比例小于 1 时,输入坐标步长大于 1,可能导致某些输入行被跳过,这时行缓冲里的数据不会每行都更新,但深度依然是 2,因为缓冲里存的是「最近两行」,被跳过的行不会出现在缓冲里。代码框架上,建议用双端口 RAM 实现环形缓冲,写指针每行跳一次,读指针根据坐标计算偏移。流水线可以拆成四个节拍:坐标计算、行缓冲读、插值系数生成、加权求和。注意 AXI4-Stream 的 tready 信号要等缓冲非空才能拉高,否则会死锁。另外,你准备用纯 Verilog 还是 SystemVerilog?如果是面试手撕,建议用 Verilog-2001 风格,因为有些面试官对 SV 的 interface 语法不熟悉。

面试官让你手撕这个,其实核心就两个词:滑动窗口、两行缓冲。你推导的时候别急着背公式,先想清楚像素是怎么流进来的。AXI4-Stream是逐像素串行,双线性插值需要2×2邻域,意味着你得同时拿到第N行和第N+1行的数据。那行缓冲深度就是一行像素的宽度,乘上2。1920宽,深度就是1920,位宽看像素格式,RGB888就是24bit。但面试官可能会追问:缩放比例0.666,输入坐标步长1.5,会不会有行跳跃?这里有个容易翻车的点——行缓冲存的是最近两行,如果缩放导致某行被完全跳过,缓冲里的数据不会更新,但深度依然是2,因为你始终只需要当前行和上一行。代码框架上,我建议用双端口RAM做环形缓冲,写指针每行跳一次,读指针根据坐标的整数部分取地址。流水线拆四拍:第一拍算坐标,第二拍读RAM拿两行数据,第三拍算权重,第四拍加权求和。注意tready信号要等缓冲里至少有两行数据才能拉高,否则会死锁。另外,你准备用纯Verilog还是SystemVerilog?有些面试官对SV的interface有偏见,手撕时建议用Verilog-2001风格,省得被挑刺。

这个问题面试官其实想看你有没有工程意识。纯理论推导,双线性插值确实只需要2行缓冲,因为2×2邻域跨越两行。但实际工程里,AXI4-Stream的backpressure会导致行首不对齐,所以很多设计会把深度设为2行+几个像素的余量,比如1920+4。代码框架上,我建议用FIFO实现行缓冲,而不是自己写双端口RAM控制器,因为FIFO的empty/full信号天然能处理握手。流水线思路:第一级写FIFO缓存当前行,第二级从FIFO读上一行数据,第三级做坐标计算和插值。注意缩放比例小于1时,输入像素可能被重复使用,所以读使能要按输出像素节拍产生,而不是每拍都读。你目前代码写到哪个阶段了?如果还在接口定义,建议先把tready和tvalid的时序画清楚,再动手写内部逻辑,这样不容易跑偏。

其实行缓冲深度这个事,面试官想听的推导很简单:双线性插值需要同时访问两行数据,所以至少2行。但为什么是1920而不是1280?因为输入行宽是1920,缓冲必须存完整的一行,否则跨行时数据会断。常见的坑在于,有人觉得缩放后输出1280宽,缓冲就可以只存1280个像素——这不对,因为输入坐标是浮动的,缓存必须以输入分辨率对齐。代码框架上,我建议用两个FIFO级联:第一个FIFO存当前行,第二个存上一行,读使能由输出像素的垂直坐标整数部分控制。注意AXI4-Stream的tlast信号要用来复位行计数器,否则行边界会错位。另外,如果你用双端口RAM做环形缓冲,写指针每收到一个tlast就加1,读指针根据坐标取模2,这样深度正好是2行。面试时建议先画个两行滑动窗口的时序图,比背公式更直观。你目前对AXI4-Stream的ready/valid握手熟悉吗?如果不太熟,建议先拿一个简单的像素加法练练手。

行缓冲深度这个问题,本质上是在考察你对数据流依赖的理解,而不是让你死记硬背公式。先说结论:对于双线性插值,行缓冲深度等于输入图像一行像素数,乘以2。推导逻辑是这样的——假设输入1920×1080,输出1280×720,缩放比0.666。当输出第0行第0列时,输入坐标是(0,0),需要取(0,0)、(1,0)、(0,1)、(1,1)四个点。此时行缓冲里要有第0行和第1行的数据。随着输出像素向右移动,输入坐标的x分量步长是1.5,所以第0行会被反复读取,但第1行一直在缓冲里。当输出到第1行时,输入y坐标跳到1.5,这时需要第1行和第2行,所以行缓冲要淘汰第0行、写入第2行。也就是说,缓冲里永远只存最近的两行数据,因此深度是2行。注意一个容易翻车的细节:如果缩放比例导致某行被完全跳过(比如比例0.4,步长2.5,可能跳过整行),缓冲依然只需要2行,因为被跳过的行根本不需要进入缓冲——你只需要维护一个滑动窗口,每来一行数据就更新一次。代码框架上,我推荐用双端口RAM加两个地址指针实现环形缓冲:写指针每收到一行的tlast就递增,读指针由垂直坐标的整数部分取模2得到。流水线可以拆成四拍:第一拍计算输入坐标,第二拍从RAM读出两行数据,第三拍生成插值系数,第四拍做加权求和。注意AXI4-Stream的backpressure处理:当读使能跟不上输出节拍时,tready必须拉低,否则缓冲会溢出。关于FIFO还是双端口RAM的选择:如果你对时序没把握,直接用Xilinx的FIFO IP核更稳妥,自己写双端口RAM容易在跨时钟域上出问题。你目前是想纯手写RTL还是用IP?不同选择对面试官的考察点影响挺大的。

深度就是2行,1920个像素,别想复杂了。面试官主要看你知不知道滑动窗口怎么更新,以及能不能说清楚为什么不需要3行。代码框架用两个FIFO串起来就行,注意tlast信号用来清计数器。你用的什么平台?如果是Xilinx,直接调FIFO IP最省事。

行缓冲深度其实就两行,不用想复杂了。推导逻辑很简单:双线性插值需要同时读当前行和上一行的像素,所以至少两行。深度等于输入宽度1920,因为缓冲必须存满一行才能跨行读取。常见翻车点是有人按输出宽度1280算深度,那不对,输入坐标是浮动的,必须以输入分辨率对齐。代码框架建议用两个FIFO串起来,第一个存当前行,第二个存上一行,读使能由输出像素的垂直坐标整数部分控制。面试时画个两行滑动窗口的时序图比背公式管用。你目前AXI4-Stream的tlast信号准备怎么处理行计数器复位?

这个问题面试官真正想看的不是你能不能背出19202这个数,而是你有没有意识到行缓冲深度本质上是数据依赖和流水线节拍之间的tradeoff。先说推导:双线性插值需要2×2邻域,意味着你得同时拿到第N行和第N+1行的像素。输入1920宽,所以每行缓冲要存1920个像素,位宽24bit(RGB888),两行就是19202的深度。但注意一个工程细节——AXI4-Stream的backpressure可能导致行首不对齐,所以很多成熟设计会加几个像素的余量,比如1920+4,避免tready拉低时丢数据。面试官如果追问缩放比例0.666,步长1.5会不会导致行跳跃,你要能答出来:行缓冲存的是最近两行,被跳过的行根本不会写进去,所以深度依然是2,不需要额外冗余。代码框架上,个人建议用双端口RAM做环形缓冲,写指针每收到一个tlast就加1,读指针根据输出坐标的整数部分取模2,这样控制逻辑最简洁。流水线拆四拍:第一拍算坐标,第二拍从RAM读两行数据,第三拍算权重系数,第四拍加权求和。注意第三拍的权重系数要用小数定点化,比如1/2.5这样的比例要提前算好查表,不然组合逻辑路径太长。另外你准备用纯Verilog还是SystemVerilog?如果是面试手撕,建议用Verilog-2001风格,有些面试官对SV的interface和logic类型不太习惯,容易在代码风格上扣分。

其实有个容易被忽略的点:双线性插值的行缓冲深度虽然理论上是两行,但具体实现时还要考虑缩放比例对读使能的影响。比如输入1920×1080,输出1280×720,缩放比0.666,输入坐标步长1.5。这意味着当输出像素向右移动时,输入坐标的x分量会以1.5的步长跳跃,所以同一个输入像素可能会被多次读取。但行缓冲的深度不受这个影响,因为缓冲存的是整行数据,读使能按输出节拍产生就行。真正需要小心的是行边界的处理——当输出坐标的y分量整数部分跳变时,上一行缓冲必须已经写入了新行数据,否则会出现数据空洞。一个保险的做法是在行缓冲后面加一个FIFO做重同步,深度设成4个像素,专门吸收行切换时的握手延迟。代码接口上,建议把行缓冲模块和插值计算模块分开,行缓冲只负责输出两行对齐的数据,插值模块专注算权重。这样调试时能单独仿真行缓冲的读写时序,省不少时间。你目前仿真环境用的是Vivado还是Modelsim?如果是Vivado,可以用自带的FIFO IP代替手写双端口RAM,省去不少握手逻辑的调试工作量。
发表回答
登录后可在本页底部提交回答