2026年FPGA大赛只剩一周,用高云FPGA做实时YOLOv8n手势识别,怎么用AXI4-Stream接口快速调通HDMI显示?求具体调试步骤

开放6 回答 48 浏览

我们队伍用高云FPGA做实时手势识别,YOLOv8n模型已经部署好了,但HDMI显示一直黑屏,怀疑是AXI4-Stream接口时序问题。现在离比赛只剩一周,急死了!请问怎么用ILA快速定位是像素数据没发出来还是时序没对齐?有没有通用的调试模板可以套用?求具体步骤,比如先测行场同步还是先测像素有效信号,在线等!

分享:

6 个回答

  • Verilog代码练习生

    先别急着抓数据,第一步把PLL锁定状态拉出来看。高云FPGA的HDMI输出如果PLL没lock,后面全是白搭。用ILA同时挂上pll_locked、axis_tvalid、axis_tready、axis_tlast这四个信号,触发条件设成tvalid上升沿。跑一帧,看tvalid拉高时tready是不是也高,如果tready一直低,说明下游FIFO满了,问题在消费端不在生产端。如果tready正常但tvalid几乎不拉高,那才是像素数据没发出来。行场同步先别看,那是最后一步的事。你先把这一层搞清楚再往下走。另外,高云的IP核例化时有个细节,AXI4-Stream的tkeep位宽要和像素位宽严格对应,不然数据错位也会黑屏。你现在是RGB888还是RGB565输出?

  • 电子工程学生

    我估计你们的问题大概率不是时序没对齐,而是握手信号根本没跑起来。给你一个通用调试顺序:第一步,ILA只挂axis_tvalid和axis_tready,触发条件设为tvalid上升沿且tready为低,这样能抓到第一个被阻塞的周期。第二步,如果抓到阻塞,看是哪个模块在反压——是DDR读数据慢,还是HDMI的fifo快满了。第三步,确认tvalid高电平时tdata上的第一个像素值是不是0x00(如果是RGB,黑屏也可能是数据全0)。第四步,才轮到查行场同步,用ILA抓hsync和vsync的周期,对照你设定的分辨率参数算一下,比如1080p就是1920个像素时钟一行,280行一帧,偏差超过1%就是时钟配置错了。还有个坑:高云HDMI IP的像素时钟和AXI时钟可能是异步的,中间必须有异步FIFO,如果你们直接跨时钟域接,黑屏是必然的。建议你们在HDL里加一个简单的fifo,深度至少256,写侧用AXI时钟,读侧用像素时钟,这样能省很多调试时间。你现在用的高云具体是哪颗芯片?不同系列的IP核配置界面差挺多的。

  • FPGA探索者

    离比赛只剩一周,说实话这个状态很危险,但也不是完全没救。我给你一条最务实的路径:先放弃在硬件上完美调通,改成软硬结合验证。你们YOLOv8n都部署好了,说明模型推理链路是通的,那HDMI黑屏只可能出在显示通路。第一步,别用ILA了,太慢。高云有在线逻辑分析仪,但配置一次要编译十几分钟,一周时间耗不起。直接写一个测试模式:把HDMI的像素数据源切换成一个计数器,输出彩条信号。如果彩条能显示,说明HDMI物理链路、时钟、行场同步全是对的,问题100%出在AXI4-Stream到HDMI的转换逻辑上。如果彩条也黑屏,那问题在HDMI本身,查电源、查I2C配置、查外部PHY芯片(如果你们用了)。第二步,如果彩条正常,再去查AXI链路。用ILA抓tvalid和tready,但触发条件设成tvalid拉高后持续超过100个时钟周期都没等到tready,这样能快速抓到死锁。第三步,重点检查你们的输出FIFO深度。YOLOv8n输出特征图可能是一整块突发数据,如果FIFO深度小于一行像素数,必然反压。常见做法是把FIFO深度设成至少两行像素,比如1080p就是3840个像素。另外提醒你们一个高云特有的坑:它的AXI4-Stream IP在tlast拉高后,下一个周期必须复位内部状态,如果你们自己写的逻辑没处理这个,第二次传输就会错位。最后一天如果实在调不通,就把HDMI输出分辨率降到800×600,帧率降到30Hz,这样时序容错大很多,很多小毛病会自动消失。你们模型输入分辨率是多少?如果输出特征图尺寸和显示分辨率差距太大,中间还得加个scaler,这个也要检查。别慌,按彩条→AXI握手→FIFO深度→分辨率匹配这个顺序走,一周时间够用。

  • 电路板玩家

    先别管行场同步,把PLL locked拉出来看,没锁后面全是白扯。锁定了就用ILA挂axis_tvalid和axis_tready,触发条件设tvalid上升沿,看tready是不是跟着高——如果tready一直低,就是下游FIFO满了,问题在消费端;如果tvalid压根不拉高,才轮到查像素数据源。这两根线搞明白,黑屏原因就定位一半了。

  • 面向百度

    个人感觉你现在的首要任务不是调通,是保住比赛演示能跑起来。YOLOv8n都部署好了,说明模型侧没问题,HDMI黑屏大概率卡在显示通路。给你个最省时间的做法:先写个测试模式,把HDMI像素源切换成计数器输出彩条。彩条能显示,说明物理链路和时钟都对,问题就锁死在AXI转HDMI的逻辑里;彩条也黑,那就查I2C、查PHY芯片供电。彩条测试过了,再用ILA抓tvalid和tready的握手,触发条件设为tvalid拉高且tready为低,这样能直接抓到第一个被阻塞的周期。别一上来就抓整帧数据,ILA深度不够,而且你只剩一周,经不起反复编译折腾。

  • 电子工程学生

    说个容易被忽略的坑:高云HDMI IP的像素时钟和AXI时钟大概率是异步的,中间必须有异步FIFO。你们如果直接把AXI4-Stream接到HDMI IP的像素侧,没做跨时钟域处理,那即使握手信号看着正常,数据也会在FIFO读写指针错位时丢像素,表现出来就是黑屏或者花屏。建议先确认IP例化时有没有勾选异步FIFO选项,或者自己插一个异步FIFO模块。另外,行场同步参数别用计算器按出来的值,直接查高云官方HDMI例程里对应分辨率的寄存器配置,比如1080p的hactive、hfrontporch这些,抄过来改时钟频率就行。你现在的像素时钟是多少?如果是148.5MHz,那大概率是标准1080p配置,如果用的是自定义分辨率,先换成标准的验证一下。最后提醒一句,ILA触发条件别设太复杂,就设tvalid上升沿且tready为低,抓到第一个阻塞点就够你分析半天了。你们现在用的是RGB888还是RGB565输出?这个也影响tkeep位宽的配置,容易错位。

登录后可在本页底部提交回答

提问者

嵌入式入门生小陈查看主页
浏览「其他」

描述场景与已尝试方案,更容易获得有效解答

相关问题

同分类

提问建议

  • 标题写清核心疑问,避免「求助」「请问」等空泛用语
  • 正文补充环境、版本、报错信息或截图
  • 先搜索本站是否已有相近问题,减少重复提问
  • 若与课程相关,请标明课时或章节便于讲师定位