2026年了,FPGA工程师做AI推理加速,HLS和RTL混编的工程里,数据流接口到底怎么定才不返工?

开放5 回答 48 浏览

最近在做一个边缘AI盒子,用Zynq跑YOLOv5s,想着HLS写卷积层快一点,RTL写DMA和接口。结果HLS生成的AXI-Stream接口和RTL那边的握手逻辑老对不上,仿真看着没问题,上板就丢数据。想问问有实战经验的兄弟,HLS和RTL混编的时候,数据流接口的位宽、对齐、反压信号这些到底怎么统一规划?有没有什么约定俗成的规范?

分享:

5 个回答

  • 单片机小白

    先别急着改代码,把仿真和上板不一致的原因找出来再说。你这种HLS生成的AXI-Stream和RTL握手对不上,大概率不是协议本身的问题,而是你对tready/tvalid的时序理解有偏差。HLS默认的stream接口,tready是组合逻辑输出的,而RTL里很多人习惯用寄存器打一拍,这一拍之差在仿真里可能因为初值或激励刚好掩盖了,上板就暴露了。我建议你第一步先做纯接口级仿真,不跑算法,只喂固定模式的数据,比如0xAAAA…和0x5555…交错,然后让RTL侧故意延迟拉低tready几个周期,看看HLS那边会不会丢数或者卡死。另外,tkeep的规则一定要写清楚,是每拍都全有效还是允许部分有效,HLS那边可以用pragma指定,但RTL侧你得自己判断,别想当然。还有个坑是tlast,HLS生成的stream在最后一拍tlast拉高,但如果你卷积层内部做了padding或池化,tlast的位置可能和你RTL预想的不一样,最好在接口处加个计数器做对齐检查。最后,反压机制建议统一用valid-ready握手,别搞什么backpressure标志位,那玩意在混编里最容易出幺蛾子。你先跑通这个再集成算法,不然debug起来会疯。对了,你Zynq用的是哪个型号?UltraScale+的AXI-Stream带宽和7系列不太一样,如果方便说下,我可以帮你看看有没有已知的坑。

  • Verilog入门

    这个问题我踩过好几次坑,给你捋一条主线吧:核心不是位宽对齐这些表面参数,而是「谁负责定义帧边界」这个责任划分问题。你想想,HLS写的卷积层,它内部是按行、按块处理的,它输出的stream天然带一种「它认为的帧结构」;而RTL的DMA只认字节流,它不管什么卷积不卷积,它只管把数据搬到DDR。所以两边对接时,tlast和tkeep的定义必须由一方主导,另一方完全跟随,不能两边各写各的。我的做法是:约定一个全局的「帧描述符」,比如每帧固定N行、每行M个像素、每个像素K字节,然后在接口处用一个小的RTL状态机来生成tlast,而不是依赖HLS自己产生。HLS那边只保证tdata和tkeep正确,tlast由外部RTL根据计数器强制拉高。这样做的好处是,HLS内部改动不影响接口,RTL侧永远知道帧边界在哪。反压方面,我强烈建议用AXI-Stream标准握手,但要注意HLS生成的tready可能不是纯组合,它内部有寄存器,所以RTL侧如果检测到tready没拉高,不要立刻重试,要等至少一个周期,否则容易丢数据。还有位宽,512bit是常见的,但如果你DMA带宽不够,比如DDR4只能跑256bit,那就在中间加个异步FIFO做位宽转换,别硬凑。我见过很多人在HLS里用#pragma HLS interface axis register,然后在RTL里又打一拍,结果两个寄存器串联,时序是没问题,但握手时序就乱了。你不如直接让HLS的stream接口不带寄存器,全让RTL去管,这样仿真和上板行为更一致。最后给你个验证招:写个简单的UVM testbench,专门测接口,把valid拉高后随机延迟tready,跑一万拍,看有没有数据丢失或重复。我当时就是用这个抓出来一个tkeep少了一位的问题。你目前是纯RTL testbench还是已经上了UVM?如果还没上UVM,建议先补这个,不然每次改HLS都要手动跑仿真,太痛苦了。

  • 硬件萌新

    接口协议就一条铁律:HLS别生成tlast,让RTL根据帧计数器自己拉。tready用标准握手,别自作聪明搞什么backpressure。先跑纯接口仿真,固定模式数据跑一万拍,过了再谈算法。你现在的现象八成是tlast位置不对,查查这个先。

  • Verilog入门者

    我觉得你这个问题问得挺实在的,因为混编工程里接口定不好,后面全是返工。先给你一个最直接的判断:你上板丢数据,大概率不是位宽或tkeep的问题,而是反压时序里藏了一拍。HLS生成的stream,tvalid和tready的握手是组合逻辑里完成的,RTL那边如果习惯性把tready打了一拍寄存器,仿真里因为激励给得干净,可能碰巧没暴露,但上板后DMA一忙起来,这拍就变成丢数据的根源。我的建议是,别急着改协议,先做一个纯接口级仿真,把算法逻辑全摘掉,只让HLS模块吐固定模式的数据,比如0x55和0xAA交替,然后RTL侧故意在每第7拍拉低tready三个周期,看看HLS那边会不会卡住或者丢拍。这一步能帮你快速定位是握手问题还是数据路径问题。接口约定上,个人比较推荐把tlast的定义权完全交给RTL,HLS那边只负责把tdata和tkeep给对,帧边界由外部一个简单的计数器状态机来拉tlast,这样HLS内部怎么改卷积结构都不影响接口。另外tkeep的规则要写死,比如每行像素数乘以字节数正好等于512bit,那就每拍全有效,如果可能有余数,就规定只有最后一拍允许部分有效,其他拍必须全有效,RTL侧收到部分有效的tkeep要能正确处理。你先按这个思路去查一下反压那拍的时序吧,如果仿真里故意加延迟还是没问题,那再回头查tlast的位置,很多坑其实都是这两个信号在边界条件下错位导致的。

  • 后端新手

    兄弟,我直接说结论吧:把tlast从HLS里拿掉,这是最省心的做法。你让HLS专心算卷积,输出流里不生成tlast,RTL这边用一个帧计数器在边界处自己拉高。这样做的好处是,HLS那边不管你怎么改循环分块、怎么调流水,接口行为完全不变,RTL永远只认自己数出来的边界。位宽统一用512bit,tkeep规则写成:非最后一拍全有效,最后一拍按实际字节数置位。反压就用标准握手,别搞什么自定义的backpressure,HLS的hls::stream配pragma可以保证tvalid不会乱拉。你现在的现象,我猜是HLS生成的tlast比你RTL期望的位置早了一拍或者晚了一拍,因为HLS内部是按块处理的,它觉得块结束了就拉tlast,但DMA那边可能还在等整帧的数据。你先写个纯RTL的testbench,只测握手,不跑任何算法,固定喂100拍数据,看RTL侧能不能完整收到100拍且tlast只在最后一拍出现。如果能过,再逐步把HLS模块加回来。这个排查顺序很重要,别一上来就两个模块联调,那样出了问题你根本分不清是协议定义错了还是HLS内部逻辑有bug。

登录后可在本页底部提交回答

提问者

嵌入式探索者查看主页
浏览「其他」

描述场景与已尝试方案,更容易获得有效解答

相关问题

同分类

提问建议

  • 标题写清核心疑问,避免「求助」「请问」等空泛用语
  • 正文补充环境、版本、报错信息或截图
  • 先搜索本站是否已有相近问题,减少重复提问
  • 若与课程相关,请标明课时或章节便于讲师定位