2026年了,FPGA工程师做AI加速卡,HLS和RTL混编的工程里,数据流接口到底怎么定才不返工?

开放3 回答 45 浏览

最近在做一个AI加速卡项目,用了HLS写卷积核,RTL写DDR和PCIe控制器,结果HLS和RTL之间的AXI-Stream接口时序老是对不上,仿真过了上板就乱。想问问大家,HLS和RTL混编的时候,数据流接口的位宽、握手机制、缓冲深度这些参数到底怎么定才能一步到位?有没有什么实战经验或者工具链配置技巧?

分享:

3 个回答

  • 嵌入式学习ing

    仿真过了上板就乱,十有八九是跨时钟域或者复位没对齐,先别急着改位宽。HLS出来的AXI-Stream和RTL侧握手,建议把tvalid/tready都打一拍再进逻辑,或者直接用Vivado的CDC约束。位宽对齐DDR突发长度没错,但缓冲深度按最差情况算完,记得留两拍余量。你用的DDR是DDR4还是HBM?

  • 电路板新手

    先别急着改接口定义,把仿真和上板不一致的根因找到再说。常见坑有三个:第一,HLS生成的AXI-Stream默认是同步于它自己的时钟域,你RTL侧如果用了不同的时钟或者复位域,仿真里同频同相看不出来,上板就露馅。第二,tready的时序,HLS一般会拉高一段时间,但RTL里你如果用了组合逻辑回传tready,很容易在Fmax不高的时候出问题,建议把tready打一拍,代价是多一个cycle延迟,但换来的是时序收敛。第三,缓冲深度,你按最差情况算是对的,但别忘了算上HLS内部pipeline的backpressure,有时候HLS输出端会突然拉低tvalid很久,这时候RTL侧FIFO深度不够就直接丢数据。工具链上,Vivado的Integrator自动连线确实省事,但它默认的配置不一定适合你,手动检查一下每个接口的FIFO深度,还有是否插了register slice。建议先做C/RTL协同仿真,把HLS的C测试平台和RTL的testbench接在一起,跑几个中间层的feature map,看数据流是否一致,这比上板调试快得多。另外,你HLS里如果用了pragma来优化循环,注意它的tripcount和接口burst长度是否匹配,不匹配的话DDR带宽会浪费。最后,个人建议接口位宽直接对齐DDR的物理位宽,比如DDR4 x64就设512bit,不要用128bit再去做拼接,徒增逻辑。你目前HLS和RTL的时钟频率分别是多少?

  • Verilog新手

    接口定得对不对,核心看数据流的节奏是否匹配。HLS这边,它默认输出是尽量满带宽的,所以tvalid会长时间拉高,但RTL侧DDR控制器是有bank冲突和刷新开销的,tready不会一直为高。你只要保证两侧的tready/tvalid时序是寄存器输出,并且FIFO深度能覆盖DDR最坏延迟,基本就不会乱。一个简单的做法:在HLS和RTL之间放一个异步FIFO,深度取DDR一次burst的2倍,比如DDR4 burst length是8,位宽512bit,那FIFO深度至少16。然后握手机制不要用tlast来传递包边界,因为HLS和RTL对tlast的解读可能不一致,建议用sideband信号或者单独的控制通道。工具链上,Vivado的Integrator会自动加register slice,但有时候会插多,导致延迟变大,你可以手动指定。验证方面,C/RTL协同仿真必做,但更重要的是做一次上板前的时序仿真,把DDR的模型带上,跑一个小的卷积层,看数据是否对齐。你目前是用Vivado 2023.2还是更新的版本?不同版本对HLS接口的默认配置有差别。

登录后可在本页底部提交回答

提问者

单片机初学者查看主页
浏览「其他」

描述场景与已尝试方案,更容易获得有效解答

相关问题

同分类

提问建议

  • 标题写清核心疑问,避免「求助」「请问」等空泛用语
  • 正文补充环境、版本、报错信息或截图
  • 先搜索本站是否已有相近问题,减少重复提问
  • 若与课程相关,请标明课时或章节便于讲师定位