2026年了,FPGA工程师面试被问AXI-Lite总线握手信号细节,只跑过IP核集成没手写过怎么办?

开放8 回答 49 浏览

最近投了几家做AI加速卡的公司,面试官一上来就问AXI-Lite的AWVALID和WVALID同时拉高时,AWREADY和WREADY响应顺序不一致会怎样?我之前项目里都是直接调Xilinx或国产FPGA的IP核,从来没手写过AXI-Lite从机逻辑。现在补的话,是先看协议规范还是直接找例程改?有没有什么高频考点能速成?

分享:

8 个回答

  • 电路设计小白

    个人感觉你现在最该补的不是协议原文,而是「状态机视角」。AXI-Lite从机说白了就是一个带握手的状态机,AW和W通道本来就是并行独立的,谁先到谁后到完全取决于主机的乱序能力。你问的AWVALID和WVALID同时拉高、但AWREADY和WREADY响应顺序不一致——这本身不是错误,协议允许两个通道各自独立握手,从机完全可以先收AW再收W,或者反过来。真正会出问题的是你只收了一个通道的地址或数据,另一个还没到就急着给BVALID,那才是时序漏洞。补的方法我建议别从头啃规范,直接找一个开源或网上常见的AXI-Lite从机寄存器组例程,比如带四个寄存器的简化版,然后自己改:把AW和W的握手拆成两个独立状态,再加一个计数器记录两边都完成后再拉BVALID。跑仿真时故意让AWREADY晚几个周期拉高,看波形里会不会出现数据丢失或地址错位。高频考点无非三个:握手超时(从机不能无限等,要设默认响应)、未对齐访问(地址低两位非零时怎么处理,通常直接忽略或按边界对齐)、读数据返回时序(RVALID必须在ARVALID和ARREADY都完成后才能拉,不能提前)。另外面试官问这个问题,其实是在试探你有没有真正理解「通道解耦」——AXI的四个通道之间没有全局握手,只有局部依赖,你只要能说清这个,就算没手写过也能圆回来。你现在是只补从机逻辑,还是连主机侧也要一起看?

  • FPGA学员3

    先把结论摆前面:你缺的不是AXI-Lite协议知识,而是「总线思维」。IP核集成做久了,人容易把总线当成一个黑盒——输入拉高、输出拉高、完事。但面试官问AWVALID和WVALID同时拉高这种细节,本质是想看你能不能跳出IP核的封装,用协议设计者的视角去推演时序。我建议你按这条线补:第一步,把AXI-Lite的五个通道画成五条独立的时间线,AW和W各走各的,B和R分别依赖前两者的完成。你只要记住一个核心规则——VALID不能等READY,READY可以等VALID;但一旦VALID拉高,就必须保持到READY拉高为止。这是所有握手混乱的根源。第二步,手写一个最小从机,不要一上来就写完整寄存器组,就写一个寄存器,地址固定0x00。状态机分三段:空闲态等AWVALID或WVALID,收到任何一个就进半完成态,等另一个也到齐后拉BVALID,完成一次写事务。读操作更简单,ARVALID一到就回RVALID。写完跑仿真,刻意让AWREADY比WREADY晚两拍,观察波形里地址和数据是否错位——你会发现只要状态机里没做「两通道都完成」判断,B通道就可能在数据还没到时就提前响应,这就是你面试时能讲的「真实踩坑点」。第三步,再回头看高频考点:握手超时一般从机不主动做,但你要知道主机侧常见做法是加watchdog;未对齐访问在Lite里通常直接忽略低两位,但要能解释为什么(因为Lite只支持32位对齐);读数据返回时序就是RVALID必须在AR握手完成后才能拉,不能提前预判。这三条你各准备一个小例子,面试时主动讲出来,比被动等问强得多。最后说个很多人忽略的点:面试官问这种题,往往不是要你默写协议,而是想听你分析「如果这里不这么做,会发生什么」——你只要能推演出数据覆盖或事务悬挂的后果,就已经合格了。你准备仿真的时候是用Vivado自带仿真器,还是习惯用Modelsim?这个会影响我给你推荐例程的方向。

  • FPGA菜鸟

    说个容易被忽略的点:你问的AWREADY和WREADY响应顺序不一致,协议层面完全合法,AW和W通道本来就是独立握手的。但真正要命的是BVALID的生成条件——很多人习惯等AW和W都完成后立刻拉BVALID,却忘了检查AWADDR和WDATA是否真的被锁存了。我见过一个工程,主机先发AW后发W,从机在AWREADY拉高后就把地址写进寄存器,结果W数据晚到两个周期,读出来全是旧值。这种bug在仿真里很难抓,因为默认时序都是对齐的。补的时候我建议先别碰协议原文,直接找一个带四个寄存器的AXI-Lite从机例程,把AW和W的握手拆成两个独立状态机,中间加一个计数器,等两边都完成后才允许B通道响应。然后故意在testbench里让WREADY晚几个周期拉高,看波形里地址和数据是不是都稳定了。面试时如果被问到握手超时,可以说从机一般不做超时检测,靠主机保证,但如果你能补充一句「实际上从机端可以用一个看门狗计数器,超时后拉ERROR响应」,这个细节很加分。未对齐访问的话,AXI-Lite本身就是32位固定对齐的,面试官要是问这个,大概率是看你知不知道协议压根不支持非对齐传输,答「主机侧负责对齐」就够。你现在最该练的其实是把IP核的黑盒拆开,自己画一遍五通道时序图,比背十遍规范都管用。你之前用的Xilinx IP核版本是2020以上的吗?不同版本对AW和W握手顺序的容忍度有差异,这会影响你复现问题的波形。

  • 零基础学

    我建议你把这次面试当成一次「总线思维」的体检,而不是补课。你之前只做IP核集成,相当于一直在用别人封装好的函数,现在要你理解函数内部的寄存器传输级逻辑。AXI-Lite的握手本质是「VALID不能等READY,READY可以等VALID」,但一旦VALID拉高就必须保持到READY拉高。AWVALID和WVALID同时拉高时,从机完全可以先收AW再收W,或者反过来,这取决于你的状态机设计。但有一个坑:如果你在AWREADY拉高时就把AWADDR写进寄存器,而WDATA还没到,那么当WREADY拉高后,你可能会误以为数据已经写入,实际写的是旧值。解决方法是把「地址锁存」和「数据锁存」分开,用一个内部有效位表示两者都完成,再触发写操作。面试时如果被问握手超时,你可以说从机一般不实现超时检测,因为协议没规定,但实际工程中会用看门狗定时器,超时后拉BRESP为SLVERR并复位状态机。未对齐访问这个点,AXI-Lite是固定32位对齐的,不支持非对齐,所以面试官问这个大概率是想看你是否知道协议边界——你只要答「主机负责把非对齐访问拆成两次对齐访问」就行。读数据返回时序也要注意:ARVALID和RVALID之间可以有延迟,但一旦RVALID拉高,RREADY必须准备好,否则会死锁。我当年补这个知识点时,把协议规范里的时序图打印出来贴在显示器上,对着开源代码一行行核对,花了两天就通了。你现在最需要的是先确认你用的FPGA型号——如果是Zynq UltraScale+,AXI-Lite从机有额外的QoS信号要处理,这会改变你状态机的优先级设计。你手头有能跑仿真的环境吗?没有的话,在线EDA工具也能凑合。

  • 零基础学

    你这个问题其实问到点子上了:IP核集成做多了,人容易把总线当黑盒,但面试官要的就是你拆开黑盒看内部时序的能力。我建议你别先啃协议规范,那玩意儿又长又绕,看完还是不会写。直接找个带四五个寄存器的AXI-Lite从机例程,最好是那种把AW和W通道拆成独立状态机的,然后自己改着玩。改的时候重点盯一个事:BVALID什么时候拉高。常见错误是AW和W任意一个完成就急着给BVALID,结果地址锁存了数据没到,或者反过来。正确做法是搞一个内部计数器或者有效位,等AWADDR和WDATA都真正被锁存了,B通道才允许响应。这个逻辑想通了,AWREADY和WREADY响应顺序不一致的问题自然就解了——协议允许两个通道独立握手,谁先谁后都合法,你只要保证最终写操作发生在两者都完成之后就行。面试时如果被问握手超时,你可以说从机一般不实现超时检测,因为协议没规定,但实际工程中如果主机一直不拉VALID或者从机一直不拉READY,总线就会卡死,所以有些设计会加个看门狗定时器,超时后强制拉高READY或者报错。这个点能说出来,至少说明你考虑过真实场景的健壮性,比单纯背协议强。另外读通道也容易被问,RVALID和RREADY的握手逻辑跟写通道类似,但要注意读数据返回的时序:主机发ARVALID后,从机可以立即返回数据,也可以等几个周期,只要保证ARREADY和RVALID都遵循VALID不能等READY、READY可以等VALID的规则就行。未对齐访问这个考点,其实就是地址低两位不是0的情况,AXI-Lite本身不支持未对齐传输,从机可以直接忽略或者报错,但面试官更想听你说出「主机端需要自己保证对齐」这个结论。补的时候建议你从单寄存器开始,状态机分三段:空闲、等AW或W、等另一边,最后合并触发写。跑仿真时故意让WREADY晚几个周期拉高,看波形里地址和数据是不是都稳定了。你之前只是集成IP核,现在手写一遍,相当于把别人封装好的东西拆开看了内部逻辑,这个思维转变比背多少条协议都重要。

  • 芯片小学生

    直接找例程改吧,别啃规范,太慢。你只需要记住一个核心:AW和W通道是独立的,谁先到都行,但BVALID必须等地址和数据都锁存后才能拉。具体做法就是拆成两个状态机,中间加个计数器,两边都完成才进写操作。面试时如果问握手超时,就说从机一般不检测,但实际可以加看门狗兜底。未对齐访问就说AXI-Lite不支持,主机需自己保证对齐。读数据返回时序,记住RVALID和RREADY的握手规则跟写通道一样就行。你之前跑过IP核,说明基本流程懂,补这个就是把手写状态机的思路打通,不用面面俱到,抓住BVALID生成条件这个核心就行。

  • 芯片小白

    说句实在的,你这种只跑过IP核的,面试官问握手细节就是想看你有没有拆黑盒的意愿。别啃规范了,直接找个带四五个寄存器的AXI-Lite从机例程,把AW和W通道拆成两个独立状态机,中间加个计数器,盯着BVALID什么时候拉高。这个想通了,九成考点都覆盖了。

  • FPGA学号1

    个人感觉你现在的焦虑来源是把协议当成了知识体系来学,其实它更像一套约束规则。面试官问AWREADY和WREADY响应顺序不一致,本质是想听你说「协议允许两个通道独立握手,谁先谁后都合法,但BVALID必须等地址和数据都真正锁存后才能拉高」。这句话能讲清楚,比背十页规范都管用。补的时候建议走这条线:先画五通道时序图,把VALID不能等READY、READY可以等VALID这条铁律标出来,然后手写一个只有地址0x00的单寄存器从机,状态机分三段——空闲态等AWVALID或WVALID,半完成态等另一个通道,完成态再拉BVALID。跑仿真时故意让WREADY晚三个周期拉高,看波形里地址和数据是不是都稳定了。握手超时不用深究,从机一般不检测,但可以提一句加看门狗兜底;未对齐访问就说AXI-Lite不支持,主机自己保证对齐。你之前跑过IP核,说明基本流程懂,补这个就是把状态机思路打通,面试时能画出来比背出来强。你面试的是AI加速卡方向,他们更在意你对数据通路稳定性的直觉,而不是协议条款的复读机。

登录后可在本页底部提交回答

提问者

数字逻辑初学者查看主页
浏览「其他」

描述场景与已尝试方案,更容易获得有效解答

相关问题

同分类

提问建议

  • 标题写清核心疑问,避免「求助」「请问」等空泛用语
  • 正文补充环境、版本、报错信息或截图
  • 先搜索本站是否已有相近问题,减少重复提问
  • 若与课程相关,请标明课时或章节便于讲师定位