2026年了,FPGA工程师做AI加速卡,HLS和RTL混编时C仿真通过但上板数据错乱,问题可能出在哪?

开放6 回答 43 浏览

最近在调一个基于Zynq的AI加速卡项目,用HLS写了卷积层,RTL写了DMA和DDR控制器。C/RTL协同仿真数据完全对上,但一上板跑起来,输出特征图隔几帧就出现错位和乱码。怀疑是HLS生成的IP和RTL之间的AXI接口握手时序没对齐,或者是DMA的burst长度配置和HLS端口位宽不匹配。有没有遇到过类似问题的朋友?你们是怎么定位这种跨语言边界的数据错乱问题的?

分享:

6 个回答

  • 代码焊工

    我建议先去查一个最容易被忽略的地方:HLS生成的m_axi端口位宽和RTL侧DMA的data width是不是真的一致。C仿真能过是因为仿真模型不会管物理层时序,但上板后AXI的wdata/rdata位宽不一致时,DMA按自己理解的burst去搬,数据就错位了。我之前遇到过类似问题,最后发现HLS端设了512bit,RTL的AXI从端只支持256bit,Xilinx的IP一般会自动插转换逻辑,但你自己写的DMA控制器不会。先用ILA抓一下m_axi的awlen和wdata,看burst长度和每拍数据是不是符合预期,再对比你的DMA描述符。另外,确认一下你的DMA描述符里地址是不是4KB对齐的,AXI协议里burst不能跨4KB边界,HLS的IP一般会自动处理,但RTL侧如果手动拼地址很容易踩这个坑。你先抓这个波形吧,大概率能看出第一个出错帧在哪。顺便问下,你的DMA是用的Xilinx官方驱动还是自己写的寄存器控制?

  • 电路板玩家小王

    跨语言边界的数据错乱,十有八九是握手时序的灰色地带,而不是数据本身算错。C/RTL协同仿真里,HLS的IP和你的RTL往往用的是同一个仿真时钟和理想化的ready/valid模型,但上板后AXI的outstanding、ID interleaving、以及HLS IP内部流水线的气泡都会带来真实延迟。我的建议是先别急着改代码,做一次「单帧回放」:固定输入特征图和权重,上板后只跑一层卷积,把HLS IP的m_axi读地址和读数据用ILA抓下来,和你仿真里的地址序列逐拍对比。正常情况下,HLS生成的IP读地址是顺序的,但如果它开了outstanding模式,可能会提前发多个读请求,而你的RTL DMA如果没按相同outstanding深度去响应,就会导致数据返回顺序错乱。另外,检查一下你的DMA burst长度配置——HLS的m_axi默认burst是16或32,如果你的RTL侧把max burst length设成了64,而DDR控制器那边又限制了4KB边界,就会在跨边界时产生不连续的地址跳变,表现出来就是隔几帧错位。还有个容易踩的坑:HLS IP的s_axilite寄存器里如果有控制位(比如ap_start、ap_done),你RTL侧去读这些寄存器时如果没做同步,亚稳态也会导致启动时序错乱。建议你先把HLS IP的ap_ctrl改成ap_ctrl_none,用RTL侧手动控制数据流,这样至少能排除控制信号的干扰。你先做单帧回放吧,看是第一个burst就错还是中间某个burst错,这个定位点能缩小一半范围。

  • 码电路的阿明

    这个问题我去年帮人调过一个类似的,Zynq上HLS卷积+RTL DMA,C仿真全对,上板隔几帧乱码,最后定位到是「AXI写通道的last信号时序」和「数据对齐」两个问题叠加。先说结论:你大概率不是算法算错,而是数据搬运的边界条件没对齐。第一个层面,HLS生成的m_axi写通道,它的wlast是在最后一个数据拍拉高的,但你的RTL DMA如果是在收到wready的上升沿就去采样wdata,而不是等wlast,那么当HLS IP因为内部流水线气泡而暂停时,wvalid会拉低,但wdata线上的旧数据可能被你的DMA误采。这在仿真里很难复现,因为仿真里的wready往往恒定拉高。解决办法:在你的RTL写通道里加一个「当wvalid拉低时必须丢弃当前拍数据」的逻辑,或者干脆用AXI VIP的严格协议检查器跑一遍你的RTL,看有没有违反wdata必须在wvalid有效期间保持稳定的规则。第二个层面,关于burst长度和4KB边界,HLS IP的m_axi端口如果设了max_burst_length,它自己会拆burst,但你的DMA描述符如果是按固定长度(比如每次传64KB)配置的,而DDR控制器那边又开了bank group interleave,那么当burst跨4KB边界时,地址会跳到下一个page,但你的DMA如果没更新描述符的地址偏移,就会把数据写到错误的位置。我建议你在RTL侧加一个地址自增检查:每次DMA完成一个描述符后,对比实际写回DDR的地址和预期地址,如果出现非连续跳变,立刻用ILA抓下来。第三个维度,是工具链层面的坑:Vivado的HLS版本和RTL综合版本如果不匹配,生成的IP的AXI接口时序可能和文档不完全一致,尤其是2023.1之后HLS对m_axi的默认行为改了,从「窄位宽burst」变成了「宽位宽burst拆分」。你可以把HLS IP的m_axi接口属性里的「num_outstanding」和「max_widen_burst」这两个参数显式设成1,强制它用最简单的顺序访问模式,先排除掉这些优化选项的干扰。最后,如果你用的是AXI Stream接口而不是m_axi,那问题可能更简单——查一下你的DMA在接收stream数据时,tkeep信号的处理,HLS生成stream数据时tkeep可能不是全1,如果你的RTL没解析tkeep就直接按固定位宽拼接,就会产生字节错位。你先告诉我你的HLS端口是m_axi还是axis,以及DMA描述符是每个特征图重新配置还是连续流模式,这样我能帮你缩小范围。

  • Verilog练习生

    个人感觉这类问题别急着翻代码,先建立「数据流追踪表」:把每一层的输入地址、输出地址、burst长度、预期数据校验和都列出来,上板后每跑完一层就用DDR读回来算一次校验和。你C仿真能过说明算法逻辑没问题,上板错乱大概率是「地址错位」或「时序违规」造成的。地址错位最常见的就是DMA描述符的地址没按AXI的4KB对齐规则去拆,HLS的IP通常会自动对齐,但你的RTL控制器如果直接用了描述符里的原始地址,就会在跨边界时产生空洞,导致数据错位。时序违规的话,重点抓两个信号:awready和wvalid的先后关系,以及bvalid和bready的握手。很多自写的DMA在收到bvalid后不是立刻拉bready,而是等下一个状态机周期才拉,这样如果HLS IP的写通道有outstanding限制,它可能会为了等bready而暂停后续写请求,导致数据乱序。你可以在ILA里同时抓awaddr、wdata、bvalid三个信号,看是否有「某个写地址的bvalid还没回来,但wdata已经写了下一个地址」的情况。另外,HLS生成的IP如果开了ap_memory接口(就是那种BRAM口而不是AXI口),你用RTL去访问它的BRAM端口时,要注意HLS默认的BRAM时序是「读地址在时钟上升沿采样,数据在下一个时钟上升沿输出」,如果你的RTL在同一个时钟沿同时给地址和采样数据,就会读错。这个在仿真里如果时钟周期设得比较宽松可能看不出来,但上板后时序收敛不好就会偶尔出错。你先做单层回放测试,固定输入,把输出和仿真对比,定位到具体是哪一层的哪个burst出错,再去看那一段的地址和时间戳。

  • 芯片设计新人

    别的都讲得差不多了,我补一个容易被坑的冷门点:HLS生成的IP在AXI接口上默认开了「窄位宽到宽位宽的转换」,也就是如果你的m_axi数据位宽是512bit,但DMA侧是128bit,HLS会自动插入一个宽度转换器。这个转换器在仿真里是完美工作的,但上板后,如果转换器的内部FIFO深度不够(默认是16拍),当DMA读侧出现反压时,FIFO溢出,数据就会丢拍,表现出来就是隔几帧错位。你可以检查一下HLS IP的m_axi接口属性里的「max_read_burst_length」和「fifo_depth」这两个参数,把fifo_depth调大(比如64),或者干脆把位宽统一成一致,绕过转换器。另外,如果你用的是Zynq的HP口(高性能AXI端口)接DDR,那要注意HP口本身有「outstanding transaction」限制,HP0口默认最多支持16个outstanding,而你HLS IP如果设置了num_outstanding=32,那么超过16个请求会被DDR控制器内部排队,但地址顺序可能被打乱。这个在仿真里用理想内存模型是看不出来的,因为仿真内存永远是立即响应。建议你在RTL侧把DMA的outstanding数也设成和HLS一致,或者让HLS侧改成num_outstanding=1,强制串行化。你先查一下你的HP口配置和HLS的outstanding参数吧,这两个数值不匹配的话,错乱是必然的。最后问下,你的DDR控制器是用的Xilinx MIG还是自己写的?如果是MIG,那它的AXI从口默认不接受非对齐的burst,你需要在DMA侧做地址对齐,这个也容易出问题。

  • 芯片初学者

    这题我在Zynq上折腾过两周,最后定位到的根因可能和你现在想的都不太一样——不是握手时序,也不是burst长度,而是HLS IP内部cache的「脏行回写」和你的RTL DMA读到了同一块DDR地址。

    具体现象是:C/RTL协同仿真里,HLS IP的m_axi端口读写DDR都是直接透过仿真模型,没有真实的cache一致性开销;但上板后,HLS生成的IP在Zynq的HP口上会启用内部的AXI FIFO和可能的L2缓存(具体看你的Vivado版本和IP配置)。如果你的RTL DMA在HLS IP还没把卷积结果写回DDR之前,就去读了同一块输出地址,那读到的就是旧数据或者半新半旧的数据,表现出来就是隔几帧错位,而且错位的位置和帧号没规律,因为HLS IP内部的回写时机受流水线气泡影响。

    我当时排查的步骤供你参考:先在HLS IP的m_axi接口上挂一个ILA,只抓awaddr、wdata和bvalid,跑单帧,你会发现写回的地址序列和C仿真里打印的完全一致,但如果你在RTL DMA那边也同时挂ILA抓读地址,会发现两边访问同一块地址的时间差有时是正有时是负——这就说明不是地址错位,而是访问顺序错乱。

    解决办法有两个方向:一是给HLS IP的m_axi加一个ap_ctrl_chain或者ap_ctrl_hs的握手,让RTL侧等HLS IP完成整层计算后再启动DMA搬运;二是如果不想改HLS代码,就在RTL DMA里加一个「读前等待」逻辑,比如HLS IP的done信号拉高后再等200个时钟周期再开始读。后者治标不治本,但能快速验证是不是cache一致性问题。

    另外提醒一个坑:Zynq的HP口如果你的HLS IP和RTL DMA都挂在同一个HP口上,Xilinx的互联逻辑可能会做写合并,导致写回DDR的顺序和你预期的不同。你可以在Vivado里把HLS IP的m_axi改成「no_buffer」或者关掉write response buffering试试。

    你先确认一下你的HLS IP在m_axi接口属性里有没有开cache相关选项,以及RTL DMA读输出特征图的启动时机是不是在HLS IP的done信号之后?如果确实是同时并发,那大概率就是这个原因。

登录后可在本页底部提交回答

提问者

变量名查看主页
浏览「其他」

描述场景与已尝试方案,更容易获得有效解答

相关问题

同分类

提问建议

  • 标题写清核心疑问,避免「求助」「请问」等空泛用语
  • 正文补充环境、版本、报错信息或截图
  • 先搜索本站是否已有相近问题,减少重复提问
  • 若与课程相关,请标明课时或章节便于讲师定位