2026年了,FPGA工程师面试被问AXI总线,除了背协议还该怎么深入准备?

开放12 回答 61 浏览

最近面试了一家做AI加速卡的公司,一面聊项目还行,二面面试官突然让我讲讲AXI总线的outstanding传输和乱序返回是怎么实现的,我直接懵了。平时用Vivado的AXI IP核都是图形化配置,从来没深入看过RTL实现。回来查了AMBA协议文档,感觉知识点太散。想请教各位大佬,FPGA工程师面试被问AXI总线相关问题时,除了背协议信号列表,还应该从哪些角度准备才能显得有深度?比如握手机制、通道依赖关系、性能优化这些,有没有推荐的深入学习路线或者实战项目思路?

分享:

12 个回答

  • FPGA探索者

    先别急着把AMBA协议从头啃到尾,面试官问outstanding和乱序返回,其实是在试探你有没有见过真实的总线压力场景。我建议你换个思路:别从协议规范入手,从你用过的那几个AXI IP核的配置界面反推。比如Vivado的AXI DMA或者AXI DataMover,里面有个outstanding transaction数目的选项,你回想一下,调大它之后,读带宽是不是上去了?那它背后做了什么事?无非就是master端在还没收到前一笔的响应时,就多发了几个AR通道的请求,让slave端的流水线别空转。面试官想听的就是这层因果。

    乱序返回这块,常见误区是以为通道里数据必须按地址顺序回来。其实AXI允许不同ID的事务乱序返回,同ID内保持顺序。你可以拿一个实际场景举例:比如你做了个多通道采集,给每个通道分配不同的ARID,那么从DDR读回来的数据可能先到通道2再通道1,你这边就得按ID把数据重新排回各自的FIFO。这个重排逻辑怎么写,比背信号名有价值得多。

    学习路线的话,我建议你直接去GitHub找个开源的AXI验证IP或者简易AXI slave的RTL,自己跑仿真,重点看两个波形:一个是一笔读事务在AW/AR通道上的握手时序,另一个是多个outstanding请求同时挂起时,RVALID和BVALID怎么交错。能把这两个波形讲清楚,比背十页协议文档管用。另外可以试试把AXI-Lite改成AXI-Full,你会发现地址通道和数据通道的依赖关系差很多。最后提醒一句:别为了显得深就硬聊QoS或者多主互联仲裁,如果项目里没用过,面试官追问细节容易露馅。你自己当前是用Xilinx还是Intel的片子?这个对准备方向有点影响,因为两家IP核在outstanding实现上的可配置性不太一样。

  • EE萌新求带

    如果你是刚被问懵、回来补课的状态,我的建议是别急着把AMBA协议从头啃到尾。面试官问outstanding和乱序返回,其实是在试探你有没有见过真实的总线压力场景。你回想一下Vivado里AXI DMA或者AXI DataMover的配置界面,里面有个outstanding transaction数目的选项。调大它之后读带宽是不是上去了?那它背后做了什么事?无非就是master端在还没收到前一笔响应时,就多发了几个AR通道的请求,让slave端的流水线别空转。面试官想听的就是这层因果。乱序返回这块,常见误区是以为通道里数据必须按地址顺序回来。其实AXI允许不同ID的事务乱序返回,同ID内保持顺序。你可以拿实际场景举例:比如你做了个多通道采集,给每个通道分配不同的ARID,那slave返回时就可以先回快的那路,不用等慢的。这样讲,比背协议里的“支持乱序”四个字有说服力得多。另外一个容易忽略的维度是通道依赖关系,比如RVALID和WVALID同时为高才能握手,但读数据通道里RLAST表示最后一拍,这个和burst length要对应上。你可以去找一个开源的简单AXI slave RTL,比如Alex Forencich的verilog-axi,把里面读通道的状态机跑一遍,比看协议文档快。真到面试现场,如果被追问“如果乱序返回导致FIFO溢出怎么办”,你能说出“限制每个ID的outstanding数量”或者“在slave端做reorder buffer”,基本就过关了。说到底,面试官不是考你背了多少信号名,是看你能不能把协议行为映射到RTL的流水线控制和资源消耗上。你现在是主要在看协议文档,还是已经有具体的AXI模块代码可以上手改?

  • 数字IC萌新

    说白了,面试官就是想听你讲“我调过outstanding数、见过DDR读延迟被盖住”这种实战故事。协议文档是字典,别抱着字典背,拿一个真实IP的配置项反推行为,比啥都强。你手头有能跑的AXI例子吗?没有就先拿Xilinx的example design开刀。

  • 硬件小白

    我建议你把学习路径按“现象-机制-代价”三层来组织,这样面试时不会散。现象层就是你用IP核时看到的配置项,比如outstanding数量、数据宽度、burst长度。机制层是这些配置到底改写了RTL里的哪个状态机或哪个计数器。代价层是性能提升背后多占了多少资源、引入了什么风险。举个例子,你为了让DDR读带宽跑满,把AXI master的outstanding从4改成16。机制上,你的读地址FIFO变深了,master可以在没有收到第一个RVALID前就连续发16个AR请求;slave端的接受队列也要相应加深,否则它会反压。代价上,资源多用了,而且如果某个请求出错,你要能定位是第几笔,跟踪逻辑变复杂。乱序返回也是同样套路。物理上,DDR控制器本身对不同bank的访问延迟就不一样,所以它返回数据时天然是乱序的。AXI用ID来区分事务,允许不同ID乱序,同ID内保序。你如果设计一个加速器,想让多个计算单元共享一个DDR端口,就可以给每个单元分配不同ID,让DDR控制器自由调度,哪个bank先ready就先回哪个。但代价是,你回读的数据在总线上顺序可能和请求顺序不一致,所以你得在接收端按ID把数据重新排队,或者干脆让每个计算单元只处理自己ID的数据,不关心全局顺序。面试时如果你能主动说出“我宁愿牺牲一点带宽也要限制outstanding数量,因为怕死锁”这种取舍,比单纯罗列协议特性高一个段位。死锁场景常见于多个master互相等对方的响应,如果你不做超时机制,总线就卡死了。学习路线的话,我推荐你去把Alex Forencich的verilog-axi里那个axi_ram_slave代码读一遍,它只有几百行,但把AW、W、B、AR、R五个通道的握手和状态机写得非常清楚。看懂之后,你再去看Xilinx的AXI DMA数据手册里关于“outstanding transfers”的说明,会有豁然开朗的感觉。项目思路上,你可以在自己的测试平台里写一个随机延迟的AXI slave,故意让响应顺序乱掉,然后观察你的master会不会出错。能把这个测试跑通,你对乱序的理解就真正落地了。另外提醒一点,面试官问这个往往不是要你设计一个AXI总线,而是想确认你调试过真实的互联问题。你如果能把之前调DDR带宽不达标时,通过调outstanding数从400MB/s提到800MB/s的例子讲出来,比任何理论都管用。你现在在做的项目里,有哪个模块是走AXI接口的吗?方便的话可以说说它的瓶颈在哪,我可以帮你想想怎么往深了挖。

  • 电路板小白

    面试官问 outstanding 和乱序返回,表面考协议,实际考的是你有没有把 RTL 行为和数据流绑在一起想过的习惯。我建议你别从协议规范入手,拿你 Vivado 里配过的 AXI IP 反推。比如 AXI DMA,你把 outstanding 从 4 调到 16,读带宽上去了,那它背后到底多了什么硬件?其实就是 master 的读地址 FIFO 深了,可以在没收到第一个 RVALID 前就连续发 16 个 AR 请求,让 DDR 控制器的流水线别空转。面试官想听的因果是:outstanding 越大,越能掩盖读延迟,但代价是你要多占 BRAM 做地址和数据缓存,而且如果某笔请求出错,你得能通过 ID 或计数器定位是第几笔,跟踪逻辑复杂度是线性涨的。乱序返回这块,一个常见误区是以为数据必须按地址顺序回来。AXI 允许不同 ID 的事务乱序返回,同 ID 内保持顺序。你可以拿多通道采集举例:给每个通道分配不同 ARID,那么响应慢的通道不会堵住响应快的通道,slave 可以先回已完成的那笔。深入一层,面试官可能追问:如果我不想要乱序,怎么强制保序?办法是让所有事务共用同一个 ID,或者 master 端在发下一笔前等上一笔的 RLAST。这背后是 AXI 的通道依赖规则——RVALID 和 RREADY 的握手必须等到 RLAST 才能结束当前事务,而 AW 和 W 通道之间有 WVALID 必须等 AWREADY 的隐含依赖。准备时别死背信号表,去写一个简单的 AXI master 状态机,比如用状态机发 4 笔读,观察地址通道和数据通道的时序关系,比你读十遍文档都管用。Xilinx 的 example design 里就有现成的,改一改跑仿真,看波形里 AR 和 R 的间隔怎么被 outstanding 影响的。你手头有能跑的仿真环境吗?没有的话先装个 Vivado 自带的仿真器就够。

  • Verilog新手村

    个人感觉,与其纠结协议细节,不如准备一个你真实调过的性能瓶颈故事。比如你发现 DDR 读带宽只有理论值的一半,排查下来是 AXI master 的 outstanding 太小,导致每次读都要等 200 个周期的 CAS 延迟。你把 outstanding 调大后,带宽上去了,但发现资源占用多了,而且乱序返回导致你软件侧的数据拼接逻辑要改。这个故事一讲,面试官就知道你不是只会勾选 IP 配置。准备方向:拿一个 Xilinx 的 AXI 例子工程,跑仿真看波形,把 AR 通道发了多少笔、R 通道返回顺序是什么、中间有多少空周期,画出来。能画出这张图,你比背十遍协议的人强。你现在的工程里用的是 AXI 还是 AXI-Lite?这俩准备深度不太一样。

  • Git入门

    别从协议头啃到尾,找块开发板写个 AXI master 状态机,发 8 笔读,看波形里 R 通道乱序回来时你的状态机崩不崩。崩一次你就全懂了。你用的 Vivado 版本是 2023 还是更老的?不同版本 example design 结构差挺多。

  • 数字电路新手

    随手说一句,面试官问这个八成是想知道你有没有被 DDR 的随机延迟坑过。你只要说『我调过 AXI DMA 的 outstanding,发现调大后读带宽从 60% 涨到 85%,但代价是 BRAM 多用了两块』,比你说十句协议定义都管用。别纠结背信号,去把 Vivado 里 IP 的配置界面截图看一遍,每个选项想不通就查它对应 RTL 的哪个参数。你最近在调 AXI 接口的板子吗?有实际波形的话,对着波形讲一遍比看文档强十倍。

  • Verilog新手村

    我想从面试官角度给你个反直觉的建议:比起你背熟信号时序,我更想听你怎么描述『当 slave 反压时,master 的 outstanding 队列里那些请求会发生什么』。很多人能画出理想波形,但一被问『如果 slave 连续拉低 RREADY 三个周期,你之前发出去的第 5 笔请求会被丢吗』就卡住。答案是不会丢,因为 outstanding 事务都记录在 master 的跟踪表里,slave 只是暂停握手,事务本身还活着。这个『事务生命周期』的概念,比信号名重要得多。深入学习路线,我建议你找 Xilinx 的 AXI Verification IP,用它的 BFM 写几个随机测试,故意制造乱序和反压,然后看 monitor 怎么报错。能自己写一个检查『同 ID 保序』的 scoreboard,面试时你能直接反客为主聊验证策略。另外,2026 年很多公司开始用 AXI5 的原子访问特性,但本质还是 outstanding + 乱序那套资源调度思想。你手头有没有用过 AXI SmartConnect 的调节能力?那个里面能看到 outstanding 如何跨时钟域传递,也是个很深的切入点。

  • Java入门

    说个很多人忽略的角度:AXI 的 outstanding 和乱序,本质是在解决『访存延迟不可预测』的问题,这和 CPU 里的 store buffer、ROB 是同一个思想。你如果学过计算机体系结构里的 Tomasulo 算法或者 scoreboard,会发现 AXI 的 ID 机制就是简化版的寄存器重命名。面试时你要是能把这层映射关系点出来,面试官会高看你一眼,因为这说明你不是在背协议,而是理解了总线为什么这么设计。准备方法:去看《计算机组成与设计》里乱序执行的章节,然后用 AXI 的 ID 和 outstanding 队列去类比它的保留站。不需要深入 RTL,能讲清楚『为什么同 ID 保序、不同 ID 乱序能提高利用率,但增加复杂度』就够了。另外,建议你实际跑一下 AXI 的仿真,故意让 slave 返回乱序,然后观察 master 侧的数据缓冲是怎么重排的——你会发现它其实是用一个 CAM 或者哈希表按 ID 去索引返回数据。这个细节比背信号列表有用得多。你之前调试 AXI 接口时,有没有在 Vivado 的波形里见过 RLAST 信号?这个信号的时序关系其实是理解事务边界的钥匙。

登录后可在本页底部提交回答

提问者

码电路的阿明查看主页
浏览「其他」

描述场景与已尝试方案,更容易获得有效解答

相关问题

同分类

提问建议

  • 标题写清核心疑问,避免「求助」「请问」等空泛用语
  • 正文补充环境、版本、报错信息或截图
  • 先搜索本站是否已有相近问题,减少重复提问
  • 若与课程相关,请标明课时或章节便于讲师定位