最近投了几家做AI加速卡的公司,面试官上来就问AXI4总线的读通道和写通道握手时序,我平时都是直接拖Vivado的IP核,从没自己写过AXI逻辑。结果被问得一塌糊涂。想问问各位大佬,AXI的五个通道到底怎么理解?INCR和WRAP突发传输有什么区别?面试官一般会追问到哪个深度?有没有推荐的实战项目能快速补上这块短板?
2026年了,FPGA工程师面试被问AXI总线,只会用IP核不会手写通道逻辑,怎么补才能过?
8 个回答

先说结论:面试官问AXI,其实不是要你背协议文档,而是想确认你有没有能力把IP核外面的那层黑盒子拆开,理解数据到底是怎么在总线上流动的。你平时拖Vivado IP核,说明你工具用得熟,但缺的是对时序关系的直觉。补这块,我建议你按三条线走:第一,把五个通道当成五个独立的快递物流环节——读地址通道是叫车去取货,读数据通道是货车把货拉回来,写地址通道是告诉收货方货要送到哪,写数据通道是货车送货,写响应通道是收货方签收并告诉你收到没有。READY和VALID就是双方说好“我准备好了”和“我有货给你”的两个信号,只有两边同时有效,这一拍数据才算真正传过去。第二,INCR和WRAP的区别,本质上是地址怎么变:INCR是线性递增,比如从0x00读到0x1F,地址就0x00、0x04、0x08一路加下去;WRAP是回卷,比如从0x0C开始读8个32位数据,读到0x1C后下一个地址不是0x20,而是回到0x00,这通常用在缓存行替换场景,因为缓存行大小固定,地址到了边界就得绕回去。第三,实战项目别一上来就写全AXI4的DMA,那会把你劝退。先写一个AXI4-Lite从机,只处理单次读写,把握手逻辑跑通,然后加上FIXED和INCR两种突发,最后再挑战WRAP。代码量其实不大,几十行状态机就能搞定,关键是仿真时要用AXI VIP或者自己写一个简单的master去驱动它,观察波形里READY和VALID的拉高时序。面试官追问的深度,一般来说会到“如果从机没准备好,READY拉低,master会不会卡死”以及“跨时钟域时AXI怎么处理”这两层,能把前者说清楚就已经超过很多只会用IP的人了。另外,我建议你把AMBA AXI协议文档里关于outstanding transaction和乱序返回那两节也扫一遍,AI加速卡场景里多笔事务并发是常事,面试官很可能顺口问一句。你现在的短板不是智商问题,是没被逼着看过时序图,花两个周末手写一遍,比刷十遍视频都管用。你目前用的FPGA芯片是哪个系列的?不同厂家的AXI IP核在时序细节上略有差别,知道型号的话我可以帮你圈一下重点。

别慌,这个问题其实有捷径。面试官问AXI,九成是在考察你懂不懂握手协议和突发模式。你先别管全接口,把AXI4-Lite从机手写出来,跑通仿真,就够应付大多数追问了。具体做法:找个现成的AXI4-Lite slave模板(GitHub上很多),对着波形把READY/VALID的时序捋一遍,重点看读数据通道里当从机延迟一拍返回时,master会不会等。然后把INCR和WRAP的区别用一句话记牢:INCR地址一直加,WRAP到边界就绕回起始地址,配合突发长度理解。实战项目就做一个简单的寄存器读写模块,用AXI4-Lite接口,把数据从PS侧写到PL侧再读回来验证。这个练完,你已经能答上手写通道逻辑的问题了。至于全AXI的DMA,那是加分项,面试被问到就说你了解框架但还没深入,别硬装。你准备投的AI加速卡岗,大概率还会问cache line和burst对齐,这块你熟吗?

兄弟,别被“手写AXI”吓住。面试官就是想听你说清楚VALID和READY同时拉高才传数据,INCR是走到底,WRAP是绕圈圈。你花一晚上把AXI4-Lite从机状态机敲出来,仿真跑通,第二天就能去聊了。剩下的,等拿到offer再补都行。

先对个标:你这不是不会 AXI,是缺一个把 IP 核黑盒拆开的契机。AI 加速卡岗问握手时序,就是想看你能不能把数据在总线上流动的细节说清楚,而不是只会配地址映射。我的建议是别一上来就啃协议文档,按三步走。第一步,把五个通道当五条独立的路:读地址是问路,读数据是取货,写地址是告诉收货方货来了,写数据是送货,写响应是收货方给你回执。VALID 和 READY 同时拉高那一拍,货才算真正交到手上,这个'一拍完成'的直觉比背信号名重要得多。第二步,INCR 和 WRAP 的区别就一句话:INCR 是从起始地址一路加到底,WRAP 是到突发长度边界就绕回起始,比如 4 拍突发从 0x08 开始,INCR 走 0x08、0x0C、0x10、0x14,WRAP 则是 0x08、0x0C、0x00、0x04,因为后两拍绕回了对齐边界。第三步,实战就做一个 AXI4-Lite 寄存器读写从机,挂在 Zynq PS 上,用 SDK 写个小程序读写 PL 侧寄存器,仿真和上板各跑一遍。这个练完,握手和地址计算就熟了。至于全 AXI 的 DMA,面试被问到就说你理解通道拆分思路,但还没到实现细节,别硬编。另外提醒一句:面试官如果让你画时序图,一定要把 READY 拉低一拍再拉高的场景画出来,这比背 INCR/WRAP 更能证明你真懂。你投的是纯算法部署岗还是偏 RTL 实现的?这决定你要不要继续往 AXI4 全接口的 outstanding 和 ID 管理深挖。

其实面试官自己写 AXI 的机会也不多,他就是想听你说清 VALID/READY 同时拉高才传数,INCR 走到底 WRAP 绕圈。你手写一个 Lite 从机跑通仿真,比背协议管用十倍。别慌。

有个点很多人没意识到:你拖 IP 核拖得熟,反而可能是面试里最危险的信号。因为 Vivado 把通道握手和地址生成全封装了,你看到的只是几个端口名,时间一长大脑会自动把 AXI 简化成'一个能传数据的黑盒子',而面试官恰恰要戳破这个黑盒子。我建议你把思路反过来,不要从协议文档学,而是从一个具体错误场景学:假设你写一个 AXI4-Lite 从机,master 发来一笔写请求,地址和数据通道都拉高了 VALID,但你的从机因为内部 FIFO 满,不能立刻收,这时你该拉低 READY 还是拉高 READY 但忽略数据?很多人会答错成前者,其实正确做法是拉低 READY,让 master 保持当前拍的数据和地址不动,直到你准备好再拉高,这一拍才算真正完成。这个'反压'场景就是握手协议的灵魂,你把这个想通了,五个通道的时序图基本能自己画出来。再说深一层,为什么 AI 加速卡岗特别爱问这个?因为片上网络和 NoC 里到处是这种反压机制,DMA 读回 feature map 时如果下游计算单元没准备好,READY 拉低一拍,整个流水线就要停一拍,这直接决定系统吞吐。所以面试官不是在考语法,是在考你有没有'时序代价'的直觉。实战项目我推荐你做一个带 AXI4 全接口的简单 DMA:从 DDR 读一段连续数据,通过 AXI4 主端口发给一个 AXI4-Lite 配置的 FIFO,再从 FIFO 读回写回 DDR,重点观察读写地址通道的 ARADDR 和 AWADDR 如何在 INCR 模式下每次加 4,以及 WRAP 模式下地址如何回卷。你仿真时故意让从机延迟几拍响应,看 master 的 AWVALID 会不会被卡住,这个观察比抄十个模板都有用。最后提醒一句:别花太多时间纠结 ID 信号和 outstanding 事务,那是高级话题,面试官一般不会在基础题里挖那么深。你现在是准备投实习还是全职?如果是全职,建议把 ARREADY 和 RVALID 之间的 gap 也画一下,这个细节容易让面试官觉得你真的写过。

说实话,面试官问AXI不是真指望你背完整协议,他就是想听你把“一拍握手”和“突发地址怎么变”说顺。你与其死磕文档,不如把Vivado里那个IP核的接口当成线索:对着写好的example design,把每个通道的VALID/READY用波形拉出来看一遍,重点看从机忙时READY拉低那几拍,master是不是把数据和地址稳稳hold住。看懂了这一个反压场景,再手写个Lite从机就顺理成章了。INCR和WRAP的区别说白了就是:INCR从起始地址一路加到长度结束,WRAP到边界绕回起点再继续,拿4拍突发从0x08开始举例,WRAP走0x08、0x0C、0x00、0x04,你画一遍地址线就记住了。练完Lite,再去看全AXI的DMA,你会发现只是多了ID和突发长度,核心还是那套握手。你投的AI加速卡岗,大概率还会问数据对齐和跨时钟域,到时候再补也不迟。你手头有没有能跑的Vivado工程,还是纯裸写代码练?

说个可能没人提的角度:你觉得自己“只会用IP核”,其实面试官怕的不是你不会手写,而是你连IP核内部发生了什么都不知道。所以补课的核心不是把RTL写得多漂亮,而是把“数据从PS侧写到PL侧再读回来”这条路径拆开讲清楚。我的建议是别一上来就碰DMA,先拿AXI4-Lite从机做寄存器读写,跑通仿真后故意在从机里加一拍延迟或FIFO满信号,看波形里READY怎么被拉低,master怎么等——这一下你就把握手吃透了。然后再做带INCR突发的全AXI主设备,比如从DDR读一段数据写到BRAM,这样你就同时练了读地址、读数据、写地址、写数据和写响应五个通道。至于WRAP,很多工程师自己都说不清,你只要记住它是为了cache line对齐设计的,地址到对齐边界就绕回起始,不会真考你算地址。另外提醒一句,面试被追问到深处时,别硬背协议,拿你仿真里遇到的一个真实问题当例子讲,比如“我写的从机在AWVALID和WVALID同时有效时,如果内部buffer满,我选择只拉低AWREADY但保持WREADY高,会不会死锁”——这种实际调试经验比背十遍协议都管用。你目前是准备先搞一个能上板跑的demo,还是纯仿真练习就够应付面试?
发表回答
登录后可在本页底部提交回答