最近在做一个基于高云FPGA的RISC-V软核SoC项目,发现ICB总线转AXI4的桥接带宽始终上不去,实测只有理论值的60%左右。怀疑是桥接逻辑里握手信号处理不够高效,或者突发传输支持不完整。有没有大佬实测过类似的桥接方案?优化方向应该放在哪里,是加深FIFO缓冲还是改进状态机调度?
2026年了,FPGA工程师用国产高云FPGA做RISC-V软核,ICB总线转AXI4桥接带宽上不去,有没有实测过的优化方案?
3 个回答

先对齐一下场景:你是拿高云的 GW 系列跑自研 RISC-V,桥接带宽卡在 60%,这数字其实挺典型的,大概率不是 FIFO 深度不够,而是握手状态机里多等了周期。个人建议别急着加深 FIFO,先抓 AXI 写通道的 AWREADY 和 WREADY 时序,很多人在这里把 IDLE 周期插多了。你查一下是否支持 AXI4 的 INCR 突发,如果 ICB 侧只能单拍,那桥接里必须做收集-合并逻辑,把连续地址的写请求攒成 burst,不然 AXI 侧永远跑在单拍模式,带宽天花板就是 60% 左右。优化方向排个序:第一改状态机去掉冗余等待,比如在读数据返回时不要等两个周期才拉 RVALID;第二在 ICB 侧加个小 FIFO 专门吸收反压,不要放在 AXI 侧,因为 AXI 的 outstanding 能力取决于从机,你加在桥接内部反而增加延迟;第三看高云官方有没有现成的 AXI 桥接 IP,我印象里他们新的参考设计里已经带 burst 支持,直接例化比自己写省事很多。还有一个容易忽略的点:RISC-V 软核如果本身是单发射无缓存架构,那 ICB 请求本来就是串行的,桥接再优化也突破不了核的瓶颈,你可以先用一个简单的 AXI 主设备发连续读测试,区分是桥接问题还是核的问题。你目前软核是自研还是用开源核?ICB 侧数据位宽是 32 还是 64?这两个条件直接影响优化方案的选择。

我做过类似的桥,不过是把 ICB 换成 AXI-Lite 转 AXI-full,本质上是一样的困境:协议转换的核心不是把信号接对,而是把「一次握手」变成「流水线握手」。你现在的 60% 带宽,我猜瓶颈在写数据通道的依赖关系上——ICB 是主从严格握手的,一拍只做一件事,而 AXI4 允许 outstanding transaction,也就是主设备可以连续发多个地址,不等数据返回。如果桥接逻辑里每个写请求都等 WREADY 拉高才接受下一个 ICB 请求,那 AXI 的流水线优势就全废了。正确做法是把桥接拆成三段:地址接收段、数据缓冲段、响应回送段。地址段收到 ICB 写请求后立刻把地址和 AXI 的 AW 通道发出去,不等 WREADY;数据段用一个双口 RAM 或者 FIFO 暂存写数据,等 AXI 的 WREADY 来了再慢慢喂;响应段独立处理 BVALID 和 BREADY,回给 ICB 时也不要阻塞新请求。这样 ICB 侧看起来就像是「写请求发出去就完事」,AXI 侧可以同时挂多个 outstanding 写事务。实测这种做法能把有效带宽推到 85% 以上,前提是从机支持多个 outstanding,如果你接的是自己写的 AXI SRAM 控制器,那它八成只支持一个 outstanding,这时候你桥接再怎么优化也就卡在 70% 附近,真正的瓶颈在从机。所以你先确认一下 AXI 从机是谁——是官方 DDR 控制器还是自己写的 RAM?如果是后者,建议先给从机加个简单的写缓冲。另外突发支持这块,ICB 如果本身不支持 burst,那桥接里要做地址连续性检测,比如连续四个 32 位写地址递增,就合并成一个 AXI INCR4,合并逻辑注意 last 信号要正确,很多新手在这里漏了 WLAST 导致从机卡死。你现在的 ICB 是主端口还是从端口方向?带宽上不去是指读方向还是写方向?如果只是读方向,那问题可能出在读返回路径上没有预取,需要单独加一个读缓存而不是写 FIFO。

先说个可能扎心的事实:60%带宽这个数字,在高云这种国产小规模FPGA上做ICB转AXI4,很多时候不是桥本身写得差,而是你软核的取指和访存pattern根本没喂饱AXI。ICB是单主单从的简单握手,AXI4那一堆outstanding和burst特性,如果RISC-V软核是单发射、无缓存、每拍最多发一笔请求那种,桥接做得再花哨,上游流量就那么多,带宽自然上不去。我建议你先别急着改状态机,花半天时间在ICB侧挂个计数器,统计一下主设备发起请求的间隔——如果平均每5拍才来一笔,那问题在软核侧,比如指令预取深度不够或者load-use停顿太长。真要优化桥接,优先做两件事:一是把ICB的写请求在桥内攒成一个小的收集FIFO,等凑够4笔连续地址且数据都齐了,再一次性以INCR4发给AXI从设备,这样能把写效率拉满;二是读通道务必支持outstanding,就是说RISC-V发出读地址后不要傻等数据回来,先把地址发给AXI,让多个读请求在总线上排队。高云官方文档里其实有个axi_lite转axi_full的示例,虽然是lite但握手拆分的思路能参考。另外提醒一句,GW系列有些型号的BRAM只有18Kb一块,你FIFO若用分布式RAM实现,面积会爆炸,注意看资源报告。你现在软核是单发射还是双发射?取指有没有挂缓存?这决定了桥的上限值不值得继续抠。
发表回答
登录后可在本页底部提交回答