2026年了,FPGA工程师用SystemVerilog做UVM验证,sequence里rand变量约束冲突导致用例跑挂,怎么定位是约束问题还是driver问题?

开放5 回答 41 浏览

最近在用SystemVerilog搭UVM环境验证一个AXI4接口的DUT,sequence里定义了几个rand变量,约束写了地址对齐和数据长度范围。跑回归的时候有个用例经常挂,报错信息指向driver里的wait状态。我自己查了sequence的约束,看起来没问题,但就是不知道是约束冲突还是driver时序没对齐。有没有大佬分享下定位这类问题的debug思路?比如怎么用`uvm_info`打印约束解算结果,或者怎么判断是随机化失败还是driver驱动时序问题?

分享:

5 个回答

  • 逻辑电路学习者

    先别急着怀疑driver,把随机化这一步单独摘出来看。你可以在sequence的body()里,在调用start_item之前,直接对那几个rand变量手动执行一次std::randomize(),然后立刻用uvm_info把每个变量的解算结果打出来。如果这里直接报RANDOMIZATION FAILED,或者打印出来的地址不是对齐的、长度超出了你设想的范围,那问题基本就锁在约束本身,跟driver没关系。常见坑是约束里用了solve…before…或者对同一个变量在多个constraint block里重复限制,SystemVerilog的约束求解器有时候会给你一个「看似满足但和你直觉不符」的解,尤其是当你有软约束和硬约束混在一起时。软约束(soft)在冲突时会被静默丢弃,很多人忘了这茬,以为soft一定会被满足。

    如果randomize单独跑没问题,那就把注意力转到driver和sequence的握手时序上。你说报错指向driver里的wait状态,这个信息很关键——UVM里sequence通过seq_item_port发起请求,driver用seq_item_port.get_next_item()取走事务,然后等一个时钟沿或者等到某些信号条件再调用item_done()。如果driver里wait的条件依赖的是DUT回过来的ready/valid信号,而sequence在生成事务时用了rand变量去控制delay或者burst长度,那很可能sequence解出来的值本身合法,但driver按这个值去等信号时,因为AXI的握手时序(比如ready拉低几个周期、wlast的位置)和driver内部状态机的预期不一致,导致死等。这时候单看sequence约束是看不出问题的,得把波形拉出来,对比driver的当前状态和总线上的实际信号。

    我自己的排查顺序是:第一步,在sequence里randomize后立刻打印所有rand变量,确认解算值;第二步,在driver的wait状态前加一个uvm_info打印当前收到的transaction内容,包括地址、长度、burst类型;第三步,开波形,把driver状态机跳转和AXI的awready/wvalid这些信号对齐看。三步下来基本能区分是约束解出了诡异的值,还是driver对合法值的时序处理有bug。另外提醒一句,回归里「经常挂」而不是「必挂」,大概率是随机种子导致的约束边界情况,建议把挂掉那次的seed固定下来复现,别用随机seed硬跑。你现在用的Questa还是VCS?不同工具的随机化失败打印格式略有差异,定位思路倒是通用的。

  • 数字系统初学者

    我碰到过类似问题,有个很省事的判别法:把sequence里的rand变量全改成固定值,跑同一个seed,如果用例不挂了,那基本就是约束解算的锅;如果还挂,那就去查driver。固定值不用改代码,直接在约束里把变量赋值,或者用`std::randomize()`加`with`临时覆盖也行。这个方法比打印uvm_info更直接,因为它把随机这个变量完全消除了,剩下的就是纯时序问题。改完如果确认是约束问题,再去看是不是某个边界条件(比如长度正好等于总线位宽的两倍、地址对齐到4096边界)触发了求解器给了一个你没想到的组合。

  • 单片机学习者

    说到底就是两条路:要么是随机化根本没成功,要么是随机出来的值driver伺候不了。你单独调一次`std::randomize()`然后打印变量,这一步就能分流。如果解算没问题但driver还是死等,八成是sequence里发事务的节奏和driver状态机的采样沿没对齐,比如你sequence里用`#10`延迟而driver在时钟上升沿采样,那delay不是时钟周期的整数倍就会出这种怪问题。把driver的采样改成和sequence用同一个时钟事件触发,或者干脆让sequence不发延迟直接等driver的`item_done`回调,很多这种挂死就消失了。我当年调AXI的UVM环境,最后发现是driver里把`awready`和`wready`的采样逻辑写反了,跟约束一点关系没有。你查波形时重点看那两个ready信号在事务中间有没有被莫名拉低,AXI协议里burst传输中途ready是可以拉低的,但很多初版driver没处理这个。

  • 算法小白

    先说结论:这种挂死,八成不是约束解算失败,而是约束解出来的值和driver的采样窗口对不上。因为约束冲突的话,`std::randomize()`会直接报`RANDOMIZATION FAILED`,而且sequence根本走不到`start_item`,报错信息不会指向driver里的wait。你现在能跑到driver的wait,说明随机化大概率是成功的。我建议你先别改driver,第一步就把那几个rand变量单独拉出来,在sequence的body最前面手动调一次`std::randomize()`,然后立刻用`uvm_info`把地址、长度、burst类型全打出来,肉眼看看有没有违反你约束直觉的组合,比如地址没按16字节对齐、len刚好是总线位宽的整数倍加1这种边界值。如果打印出来没问题,那就把目光挪到driver的采样时机上。AXI的写通道有个典型坑:driver在等待`awready`和`wready`同时拉高才认为握手完成,但sequence发完地址后马上发数据,中间如果sequence用了`#10`这种固定延迟,而driver在时钟上升沿采样,延迟不是周期的整数倍,就会出现driver还在等下一个沿,sequence已经发完走了,两边各等各的。你开波形,把driver里那几个wait对应的信号拖出来,看是不是awready拉高了但wready一直没动,或者反过来。如果波形里ready信号确实有拉高但driver没退出wait,那就是采样逻辑写反了,跟约束一点关系没有。顺带提一句,还有一种隐蔽情况:约束里用了`soft`,冲突时被静默丢弃,解出来的值符合硬约束但不符合你的业务预期,这种也能通过打印看出来。你先打印,再开波形,基本一轮就能分流。你现在的sequence里,driver握手是用的`item_done`回调还是固定延迟?不同写法排查方向差挺多的。

  • FPGA萌新

    这个问题我早期也绕了很久,分享一个我后来一直用的排查顺序,可能对你有参考。先别碰driver,把随机化和时序两件事彻底拆开。第一步,在sequence的body里,在`start_item`之前,手动对那几个rand变量单独执行一次`std::randomize()`,不加任何`with`,就用你原来定义的constraint block。如果这里报错,或者打出来的值明显越界,那约束本身就有硬伤,常见原因是你用了`solve…before…`去控制概率分布,结果和另一个constraint block里的范围限制互相打架,求解器给了个满足所有约束但反直觉的极值,比如地址对齐到4096边界、长度刚好等于总线位宽的两倍。还有一种更隐蔽的,是你有个约束块里写了`addr % 16 == 0`,另一个块里又用`soft`限制了`addr`的上限,当两者冲突时`soft`会被静默丢弃,地址反而解出一个很大的值,这种情况不打印根本看不出来。第二步,如果随机化单独跑没问题,那就把打印出来的值手动固定回去,比如直接在sequence里给变量赋常量,跑同一个seed,如果用例还挂,那问题就锁死在driver侧,跟约束完全无关。第三步才是查driver。AXI的driver挂死,我见过最多的两类:一类是采样事件不匹配,sequence里用`#delay`控制节奏,而driver在`@(posedge clk)`采样,delay不是时钟周期的整数倍时,两边会逐渐错位,表现为偶尔挂、偶尔不挂,跟seed有关。另一类是握手信号的采样逻辑写反了,比如把`awready`和`wready`的组合条件写成了`||`而不是`&&`,或者采样的是下降沿而DUT在上升沿拉高。你开波形,把`awvalid`、`awready`、`wvalid`、`wready`四根信号拖出来,对齐时间轴看:如果sequence已经拉高了valid,但ready始终没拉高,那是DUT或VIP侧的问题;如果ready拉高了但driver没退出wait,那是driver内部状态机跳转条件写错了。最后说个个人习惯:我一般不在sequence里用`#delay`控制事务节奏,而是靠driver回传`item_done`来同步,这样两边天然对齐,少了很大一类时序race。你现在这个环境,sequence和driver之间是靠`item_done`握手还是各走各的延迟?如果是前者还挂,那基本就是driver内部状态机的问题了。

登录后可在本页底部提交回答

提问者

逻辑芯片爱好者查看主页
浏览「其他」

描述场景与已尝试方案,更容易获得有效解答

相关问题

同分类

提问建议

  • 标题写清核心疑问,避免「求助」「请问」等空泛用语
  • 正文补充环境、版本、报错信息或截图
  • 先搜索本站是否已有相近问题,减少重复提问
  • 若与课程相关,请标明课时或章节便于讲师定位