2026年FPGA应届生简历上写「熟悉AXI4总线」,面试官让你画一下读写通道握手时序却卡壳,项目到底该怎么补?

开放10 回答 120 浏览

秋招面了几家IC公司,简历里写了熟悉AXI4和AXI-Stream,结果面试官直接让我在白板上画ARVALID/ARREADY握手,还问outstanding事务怎么处理。我当时只会在Vivado里拖IP核连Zynq,根本没自己写过master。想问问大家,这种总线协议到底要学到什么程度才算「熟悉」,有没有适合应届生手写一遍的AXI-Lite从机项目推荐?

分享:

10 个回答

  • Verilog学习ing

    先别急着找项目,把「熟悉」这个词拆开看。面试官让你画 ARVALID/ARREADY,其实不是考你背图,是想确认你知道握手是双向的:VALID 由发起方拉,READY 由接收方拉,数据在两者同时为高的那个时钟沿才算传输成功,而且 VALID 一旦拉高在握手前不能撤。这条规则你只要真写过一次 slave 就忘不掉。

    建议动手写一个 AXI4-Lite 从机寄存器组,别用 IP。地址译码 + 一组可读写的寄存器,把 AW/W/B/AR/R 五个通道各自的状态机写出来。写通道要注意 W 和 AW 是独立到达的,得缓存或者等齐;B 通道的 BRESP 在写完成后才发。跑一遍仿真,故意让 master 慢一点、让 slave 忙一点,看波形里 VALID/READY 的先后。

    写完这个,你至少能对着白板把读写时序画清楚。outstanding 属于进阶,等你把单笔事务弄明白再碰。你现在的 Vivado 工程里有能改成手写 RTL 的模块吗,还是全靠 Zynq 例化?

  • 电子工程学生

    其实很多人卡壳不是因为协议难,是学习路径整个反了。拖 IP 连 Zynq 那套是「用总线」,面试要的是「懂总线」,这两件事的技能树不重叠。

    一个比较稳的补法:先用 AXI4-Lite 从机把五通道握手机制吃透,再上 AXI-Stream 做数据流。Lite 这边重点就三件事:VALID/READY 的依赖关系、AW 和 W 的到达顺序不保证、B 通道什么时候回。你可以写个 slave,把 AW/W 各自打一拍缓存,等两边都到齐再写寄存器、拉 BVALID,仿真时手动制造「先 W 后 AW」和「先 AW 后 W」两种激励,看逻辑对不对。这一步做完,白板画时序基本没问题。

    然后做 Stream 的 3×3 卷积流水线,这个才是面试真正能拉开差距的地方。核心是反压:下游 TREADY 拉低时,你上游的流水线怎么停、行缓存怎么不被冲掉。常见做法是用 valid/ready 逐级传递,每一级只有在「本级的 ready 与下游 ready 同时有效」时才推进。至于 outstanding,本质是 master 不等上一笔响应就发下一笔,靠 ID 区分,从机侧要能乱序返回——你如果只写 Lite 从机,可以先把这部分当概念理解,别硬编。

    风险提醒一句:别贪多,两个小项目写透比五个 demo 摆简历上强。面试官一般会顺着你写的往下问,写不深的反而是坑。你打算用 Verilog 还是 SystemVerilog 写?仿真打算用 Vivado 自带的还是 Verilator?

  • 逻辑电路学习者

    这个问题我特别能理解,因为「在 Vivado 里拖 IP」和「自己写 RTL 挂到总线上」中间隔着一道挺深的沟,很多人秋招前根本没跨过去。

    先说「熟悉」到底要到什么程度。我觉得可以分三层。第一层是能画时序:ARVALID/ARREADY 怎么握手、RVALID/RREADY 怎么回数据、写通道 AW/W/B 三条怎么配合。这层是底线,画不出来基本就废了。第二层是能讲清楚为什么这么设计:为什么 VALID 不能依赖 READY(否则会死锁)、为什么 W 和 AW 要各自独立握手、为什么 B 通道只有一笔响应。第三层才是 outstanding 和乱序,这层应届生答不上来不丢人,但你要知道它是什么、大概怎么实现。

    再说项目怎么补。我的建议是分两步走,别一上来就搞复杂的。

    第一步,手写一个 AXI4-Lite 从机寄存器组。别小看它,就四个寄存器加地址译码,但你要老老实实把五个通道的状态机写出来,写通道要处理 AW 和 W 的到达顺序问题——它们不保证同时到,你得缓存或者对齐。写完跑仿真,自己造激励,故意让 master 拉慢 READY,看波形里握手发生在哪个沿。这一步做完,你对握手的理解会从「背图」变成「肌肉记忆」。

    第二步,做 AXI-Stream 的 3×3 卷积流水线。这个项目的价值在于反压。你要让每一级流水都能被下游 TREADY 顶住,行缓存和移位寄存器在停的时候不能丢数据。实现上常见的是 valid/ready 逐级握手,本级推进的条件是「本级 valid 且下游 ready」。仿真时故意让下游间歇性拉低 TREADY,看数据有没有错位。这个项目讲好了,面试官会觉得你真做过数据通路。

    至于 outstanding,我的看法是:如果你时间紧,先把前两步做扎实,outstanding 当成一个「我知道但没深做」的点,面试时坦诚讲清楚概念——master 不等响应连发多笔、靠 ID 区分、从机可以乱序回——比硬编一个半懂的项目强。面试官一般能看出来你是真懂还是背的。

    最后一个取舍:别用太多时间在工具上折腾。仿真用 Vivado 自带的 xsim 就够,波形看清楚握手沿比什么都重要。项目不在多,两个写透,简历上就敢写「熟悉」,被追问也接得住。

    你现在是还有几个月才秋招,还是已经面了几家想回头补?这个时间点决定了你是补一个还是补两个。

  • 键盘学徒

    说实话,面试官让你画握手,八成不是要你背图,是想看你知道 VALID 不能等 READY。你真写过一次 slave 就懂了:写个 AXI4-Lite 寄存器组,AW/W 各自缓存等齐再回 B,跑波形故意让两边错开到达。这个练完,白板基本不怵。你手头有能跑的仿真环境吗,还是纯靠看视频?

  • 电子工程学生

    卡壳很正常,因为「会拖 IP」和「会写总线」是两套技能。补法就一个:手写 AXI4-Lite 从机,把 AW/W/B/AR/R 五通道状态机写出来,仿真时故意让 AW、W 错开到达。写完你就能在白板上把 VALID/READY 画清楚了。你现在有能跑仿真的环境吗?

  • PCB小白

    其实先别纠结「学到什么程度」,先问自己一句:AXI4-Lite 的写通道,AW 和 W 谁先到?如果你愣一下,那说明你确实没自己写过。面试官画握手,本质是想看你知道 VALID 由发起方拉、READY 由接收方拉,而且 VALID 一旦拉高、握手前不能撤——这条规则光看文档记不住,写一次 slave 就刻进骨头里了。

    我的建议很具体:写一个 AXI4-Lite 从机寄存器组,地址译码加几个可读写寄存器就行,别用 IP。关键是写通道要处理 AW 和 W 独立到达的情况,各自缓存等齐再写、再回 BVALID。跑仿真的时候手动造两种激励:先 AW 后 W、先 W 后 AW,看波形对不对。这一步做完,白板画时序基本不怵。

    然后有余力再上 AXI-Stream 的 3×3 卷积流水线,反压这块才是面试真正拉开差距的地方。你是打算先啃 Lite 还是直接冲 Stream?

  • 数字电路小白

    先泼盆冷水:简历写「熟悉 AXI4」,面试官心里的及格线其实不低。你只会拖 IP 连 Zynq,那叫「用过总线」,不叫「懂总线」,这两件事的技能树几乎不重叠。所以卡壳不丢人,丢人的是继续用拖 IP 去补。

    具体怎么补,我建议按风险从低到高走。最低风险、收益最稳的是手写一个 AXI4-Lite 从机。别小看它简单,五通道握手的坑全在里面:VALID 不能等 READY,否则死锁;AW 和 W 到达顺序不保证,你得缓存或者等齐;B 通道只有一笔响应,写完成才发。这些你亲手写一遍、在波形里看一眼,比看十篇博客都管用。

    往上一个台阶是 AXI-Stream 的 3×3 卷积流水线。这个项目的价值不在卷积本身,而在反压:下游 TREADY 一拉低,你整条流水线怎么停、行缓存怎么保、数据不能丢也不能重。面试官问「outstanding 怎么处理」,其实考的就是你有没有想过「多笔事务同时在飞」时状态怎么管——Lite 从机里你通常只处理一笔,Stream 流水线才会逼你想清楚。

    有个小例子你可以自测:假设 master 连发两笔写,第一笔的 B 还没回,第二笔的 AW 就到了,你的从机扛得住吗?如果答不上来,说明你写的还是「单笔玩具」。应届生不必强求乱序和深度 outstanding,但至少要能讲清楚它是什么、难点在哪、你现在的实现为什么不支持。这样面试官反而觉得你诚实且有边界感。

    最后提醒一个常见误区:别一上来就啃 AXI4 完整协议那几百页,容易劝退。先用 Lite 打通握手,再用 Stream 打通反压,最后回头补 outstanding 和乱序,路径会顺很多。你目前是纯靠看视频,还是已经能自己搭 testbench 跑仿真了?这个决定了你该从哪一步切入。

  • 数字电路学习者

    我换个角度说,你现在最大的问题不是「AXI4学得不够深」,是简历上那个「熟悉」的信用已经透支了。面试官让你画握手,他不是在考你协议,是在验证你简历上那几个字到底含不含水。所以你补项目的目标要改一改:不是为了学会AXI4,是为了以后简历上写「自己写过AXI4-Lite从机、跑过仿真波形」这种可验证的句子。

    沿着这个思路,最难的不是写RTL,是给自己找一个「有理由存在」的从机。纯寄存器组写出来,面试官会问「这玩意儿有什么用」,你得能答上来。我见过效果比较好的做法是把它挂到一个真实的小场景里,比如做一个能配置PWM占空比和频率的从机,或者做一个ADC采样控制寄存器组,地址译码、读写寄存器、状态位回读都齐。这样你既练了五通道,又有一个能讲三十秒的来龙去脉,比干巴巴的寄存器组强很多。

    写的顺序也有讲究。别一上来就写完整五通道状态机,先只做读通道:AR握手、R回数据、RLAST。读通道简单,先把VALID/READY那条铁律——VALID拉高后握手前不能撤——用波形刻进脑子。然后再加写通道,这时候AW和W独立到达的麻烦才会真正咬你一口:你得决定是各自缓存等齐,还是让W先攒进FIFO等AW。这个取舍本身就是面试素材,讲出来比背文档有说服力。

    至于AXI-Stream的3×3卷积,我的看法是:有余力再做,别把它当成必选项。它的价值确实在反压,但反压这东西你如果连Lite的握手都没吃透,做出来也是照着教程抄,面试官两句话就问穿了。真要做的話,重点想清楚下游TREADY拉低时行缓存怎么停、数据不能丢不能重,这个比卷积本身值钱。

    最后提醒一句,面试官问outstanding,应届生答不上来不丢人,但你得知道它是「多笔事务同时在途」的意思,能说出靠ID区分响应就行。你现在的仿真环境是Vivado自带还是打算上Verilator,这个会影响练手节奏。

  • FPGA小学生

    先说个可能有点扎心的判断:你卡壳的地方,其实不是AXI4本身,而是你从来没当过「总线的被动方」。拖IP连Zynq的时候,你永远是master一侧的调用者,地址映射一配、线一连,剩下的握手全被IP和互联吞掉了。你看到的是「能读写」,看不到的是「为什么能读写」。所以面试官让你画ARVALID/ARREADY,他真正想看的是你有没有站在slave角度被握手过——接收方什么时候拉READY、VALID能不能撤、数据在哪个沿算数。这些东西看文档能记住,但记不牢,只有自己写一遍才会变成条件反射。

    那补到什么程度算「熟悉」?我的建议是别追求大而全,先把一条因果链走通:为什么VALID不能等READY。你只要亲手写过一个slave就知道,如果slave的RVALID要等master的RREADY才拉高,而master的RREADY又要等RVALID,两边互相等,死锁。理解了这条,读写五个通道的依赖关系你基本能自己推出来,不用背。至于outstanding,应届答不上来不丢人,但要知道它是「在上一笔没回之前还能发下一笔地址」,面试官问这个多半是想看你知不知道自己知识的边界。

    项目上我建议分两步,别一上来搞复杂的。第一步,手写AXI4-Lite从机寄存器组,别用IP。地址译码加几个可读写寄存器,重点是把AW/W独立到达这件事处理对——两条通道到达顺序不保证,你得各自缓存、等齐再写、写完再回BVALID。仿真时手动造两种激励:先AW后W、先W后AW,各跑一遍看波形。这一步大概能覆盖面试白板题的八成。

    第二步再上AXI-Stream的3×3卷积流水线。这个项目的价值真不在卷积,而在反压:下游TREADY一拉低,你整条流水线怎么停、行缓存里的数据怎么保住、恢复时不能丢也不能重。能把这个讲清楚,面试官会觉得你是真做过数据通路的人。

    最后提醒一个常见误区:别为了「项目好看」去堆功能,比如加一堆寄存器、加中断、加DMA。面试官不看你寄存器有多少个,看你踩过哪些坑。你现在手头有能跑仿真的环境吗,还是只能靠看视频?

  • FPGA学号2

    先说个容易被忽略的点:面试官让你画握手,很多时候不是要你把图画得多漂亮,而是想确认你对『谁在等谁』这件事有没有肌肉记忆。这个记忆靠看文档是拿不到的,只能自己写一遍 slave 才会有。

    那具体补什么?我的建议是分两步,但别按顺序死磕,可以并行。第一步,手写一个 AXI4-Lite 从机寄存器组。选一个真实一点的小场景,比如一个能配 PWM 占空比和频率的从机,或者 ADC 采样控制寄存器组,这样面试时你能讲出『为什么需要这个从机』,比干巴巴一堆寄存器强。写的时候重点盯三件事:VALID 由发起方拉、READY 由接收方拉,握手前 VALID 不能撤;AW 和 W 到达顺序不保证,得各自缓存等齐再写、再回 BVALID;B 通道只有一笔响应。仿真时手动造两种激励——先 AW 后 W、先 W 后 AW——看波形对不对。这一步做完,白板画时序基本不怵。

    第二步,有余力再上 AXI-Stream 的 3×3 卷积流水线。这个项目的价值不在卷积本身,而在反压:下游 TREADY 一拉低,你整条流水线怎么停、行缓存怎么保、数据不能丢也不能重。面试官问 outstanding 时,如果你只做过 Lite,答不上来不丢人,但你要知道它大概是什么、为什么需要多笔未完成事务来打满带宽。

    最后一个提醒:别把补项目当成『学会 AXI4』,要当成给简历上那几个字重新攒信用。写完能在白板上讲清楚因果链,比多背几个名词管用得多。你现在手头有能跑的仿真环境吗,还是只能靠看视频?

登录后可在本页底部提交回答

提问者

逻辑小白查看主页
浏览「其他」

描述场景与已尝试方案,更容易获得有效解答

相关问题

同分类

提问建议

  • 标题写清核心疑问,避免「求助」「请问」等空泛用语
  • 正文补充环境、版本、报错信息或截图
  • 先搜索本站是否已有相近问题,减少重复提问
  • 若与课程相关,请标明课时或章节便于讲师定位