今年投了几家芯片公司,笔试里连续出现AXI4-Lite读写时序、握手信号valid/ready的题目,我平时只写过UART和SPI,看到burst和outstanding直接懵了。想问下这类总线题到底在考什么,剩下两周该刷哪些题、看哪些开源代码才能应付?
2026年FPGA校招笔试开始考「用Verilog写AXI4-Lite从机接口」,没做过总线的应届生该怎么临时补?
8 个回答

两周别贪多,先把AXI4-Lite的读写通道手画一遍:valid/ready谁先谁后、地址译码怎么映射到寄存器。找份开源slave代码对着仿真波形看一遍,比刷十道题管用。burst和outstanding是AXI4-Full的事,Lite根本没有,别被吓到。

别被 burst、outstanding 吓到,AXI4-Lite 压根没有这两个东西,出题人写上去多半是凑字数。两周就把读通道和写通道的 valid/ready 时序手画几遍,再找个开源 slave 对着波形看地址怎么译码到寄存器,足够了。

个人感觉最省时间的路子是:先别碰 AXI4-Full,直接把 Lite 当成一个带握手的寄存器堆来理解。写通道就是主机先给 AW(地址)和 W(数据),你回 B 告诉它写完了;读通道是主机给 AR,你回 R 带数据和 RRESP。valid/ready 的规矩只有一条:谁先拉高都行,但一旦 valid 拉起来就不能反悔,必须等对方 ready 才能撤。你要做的是在纸上把这四条通道各画一次波形,标清楚每个信号什么时候起、什么时候落。然后去 GitHub 搜 axi4lite slave verilog,挑一个两三百行的照着敲一遍,跑个 testbench,自己造几个读写 transaction 看波形对不对。地址译码那部分最容易出错,注意地址要按 4 字节对齐,写寄存器时 wstrb 决定哪几个字节有效,别整块覆盖。两周里前十天做这些,最后几天把常见面试问法过一遍,比如「ready 一直不来的话 valid 能撑多久」「读数据没准备好怎么插等待」,能说清楚就差不多了。你手头有能跑仿真的环境吗,比如 Vivado 或者 iverilog?

两周的话,我建议你只干一件事:把 AXI4-Lite 的写通道和读通道各手画一遍波形,然后写个最小 slave 跑通仿真。别急着看 Full,Lite 没有 burst 也没有 outstanding,笔试题里出现这两个词多半是干扰项。
具体点:写通道就三条——主机先发 AW 地址和 W 数据,你回一个 B 表示写完;读通道主机发 AR,你回 R 带数据。valid/ready 的铁律是 valid 拉起来后不能撤,必须等 ready。地址译码那步最容易翻车,记得按 4 字节对齐,写的时候用 wstrb 挑哪些字节生效。
找份开源的 axi4lite slave(GitHub 上搜就有,两三百行那种)对着仿真波形看一遍,比刷十道题管用。你现在手上有仿真环境吗,ModelSim 还是 Vivado 自带的?

两周时间,别按「学总线」的思路走,按「能写出一个能跑通的最小 slave」来倒推就够了。AXI4-Lite 本质就是一个带握手的寄存器读写接口,你写过 SPI 其实已经理解一半了,无非是把片选和时钟边沿换成了 valid/ready 这一对信号。先花半天把读写通道的依赖关系画出来:写是主机先给 AW 和 W(这两个可以先后到,也可以同拍到),你回 B;读是主机给 AR,你回 R 带数据和 RRESP。记住 valid 一旦拉高就不能撤,必须等 ready,这是笔试最爱挖的坑。然后找一份开源 axi4lite slave 的 Verilog(两三百行那种),照着敲一遍,自己写个 testbench 发几笔读写,看波形对不对。地址译码按 4 字节对齐,写的时候用 wstrb 决定哪几个字节生效。burst 和 outstanding 是 AXI4-Full 的东西,Lite 里没有,看到就当干扰项跳过。你手头用的是 Vivado 还是别的仿真环境?

先给你吃颗定心丸:AXI4-Lite 的笔试题翻来覆去就那么几个考点,两周完全够。但这里有个风险要提醒你,很多人一上来就去啃 Xilinx 的 AXI 手册,几百页看下来时间全没了,结果波形还是画不出来。正确顺序应该是反过来:先动手,再查手册补细节。
具体说,你需要攻的就三块。第一是握手,valid/ready 的四条通道各自什么方向、什么时候能拉低、valid 拉高后能不能撤,这几条规矩背下来还要能在波形上标出来。第二是地址译码,主机给的地址怎么落到你的寄存器上,注意低位对齐,别把字节偏移算错。第三是读写通路,写通路的 AW 和 W 谁先谁后、B 什么时候回;读通路的 AR 到 R 之间有没有延迟。
一个很实用的小练习:拿一份开源 slave,把它的地址位宽改成 8 位、寄存器减到 4 个,然后自己写 testbench 往里写 0xDEADBEEF 再读回来,看波形里 wstrb 是不是四个字节都拉高了。改代码比读代码记得牢。
顺便说个取舍:如果时间只剩三天,就只保握手和读通道,写通道能说清流程即可,别追求全对。你现在是纯零基础,还是 UART 那套时序已经写得很熟了?这决定你要不要先补一遍时序逻辑的写法。

我想从「这类题到底在考什么」这个角度帮你捋一下,因为想清楚这个,两周该干什么自然就清楚了。
笔试考 AXI4-Lite,表面考协议,实际考的是三件事:你懂不懂握手协议背后的因果、你能不能把抽象协议落到具体 RTL、你有没有调试时序的直觉。UART 和 SPI 是点对点的固定时序,你只要数节拍就行;而 AXI 的 valid/ready 是一种「双方都可以主动、但都不能反悔」的协商机制,这才是它和 UART 的本质区别。理解了这一层,valid 拉高不能撤、ready 可以先拉也可以后拉这些规矩就不是死记,而是理所当然。
那两周怎么排?我的建议是分三段,但别平均用力。前三天只干一件事:把写通道和读通道各画三遍波形,画到你闭着眼能说出每个信号在哪个周期起落。画波形这件事看着笨,但它直接对应笔试里那种「给出时序图问哪里错」的题型。中间一周找一份开源 axi4lite slave,先照着敲,再自己改参数——改地址位宽、改寄存器数量、加一个只读寄存器——每改一次跑一次仿真看波形,这个过程会让你对地址译码和 wstrb 的理解从模糊变具体。最后几天做两件事:一是把 Xilinx 手册里 Lite 那几页翻一遍,对照自己写的代码看有没有漏的响应类型,比如 SLVERR 什么时候该回;二是找几道握手类题目限时做,练手速。
有几个坑提前说。第一,别一上来啃 Full 的手册,burst、outstanding、乱序返回这些在 Lite 里根本不存在,你被这些词吓到纯属浪费情绪。第二,别只读代码不动手,看别人写的 slave 你会觉得「懂了」,自己写的时候地址译码那几行照样卡住。第三,别忽略 testbench,很多应届生 RTL 写得还行,但不会造激励、不会看波形,面试官一问「你怎么验证的」就哑了,而验证能力在 IC 岗里权重不低。
再往深一层说,AXI4-Lite 其实是你接触「总线思维」的入口。以后做 SoC,你会遇到 AXI4-Full、AXI-Stream、APB 桥,它们共享同一套握手哲学,只是复杂度不同。所以这两周的目标不该是「背下 Lite 的题」,而是通过 Lite 把握手这套思维建立起来,这样后面遇到别的总线你也能自己推。
最后给个判断标准:如果你能在白纸上画出一次完整写事务和一次完整读事务的波形,标清每个信号的起落和依赖,并且能解释为什么 valid 不能撤,那笔试这一关基本稳了。你现在卡在哪一步,是波形画不出来,还是代码写出来仿真不对?

两周时间其实够用,但我想先泼一点冷水:如果你只背协议条文,笔试稍微换个问法就容易翻车。这类题真正在筛的是「你能不能在脑子里把波形跑起来」,而不是你记不记得住通道名字。
一个很典型的风险是:很多人花五天把 Xilinx 的 AXI 手册从头翻,结果真到做题,给一张 valid/ready 时序图问你第几个周期能完成握手,还是答不上来。原因是他看的是文字描述,没在波形上验证过。所以我的建议是反过来——先画波形,再回手册补细节。
具体可以这样排:头两天只做一件事,把写通道(AW、W、B)和读通道(AR、R)各画三遍波形,每遍都标清楚 valid 和 ready 谁先拉、哪个周期数据有效。画到你能对着空白纸默写出来为止。第三天开始找个开源 slave 代码,两三百行那种,把地址位宽改小、寄存器减到四个,自己写 testbench 发几笔读写。这一步的关键不是代码写得多漂亮,而是你要亲眼在仿真波形里看到 wstrb 怎么控制字节使能、B 响应什么时候回来。
剩下几天可以拿这套最小 slave 去自测:把 valid 延迟几个周期拉、ready 提前拉,看你的逻辑会不会挂死。这个练习比刷十道选择题都值,因为笔试里那些「下列时序哪个正确」的题,本质就是在考你会不会判断这种边界情况。burst 和 outstanding 在 Lite 里确实不存在,看到直接跳过就行。
你现在手边有能跑仿真的环境吗,还是只能用在线工具?
发表回答
登录后可在本页底部提交回答