2026年FPGA校招笔试考「用Verilog实现一个AXI4-Lite从机寄存器组」,没接触过总线的应届生该按什么顺序啃下来?

开放9 回答 87 浏览

今年投FPGA岗,笔试里直接让写AXI4-Lite从机的读写通道握手,我只写过UART和SPI,看到AWVALID/AWREADY就懵了。想问问有经验的前辈,笔试现场时间紧,应该先写地址译码还是先搭握手状态机?平时准备的话,是不是得先吃透AXI时序图再手写一遍?有没有推荐的练手顺序,比如从简单的单寄存器读写开始逐步加burst?

分享:

9 个回答

  • 电路设计萌新

    先说结论:笔试现场先搭握手骨架,地址译码往后放。原因很实在——AXI4-Lite从机的难点不在译码,译码就是个case比较,真正容易写崩的是AW/W/B三个通道的先后关系和ready/vaild的拉法。如果你先埋头写地址译码,写到一半发现AWREADY和WREADY的时序对不上,前面那堆译码逻辑全得推倒重来。

    具体到考场,我的建议是脑子里先有个最小骨架:写通道侧,AWREADY和WREADY可以常拉高(Lite场景下这是最常见也最稳的做法),收到AWVALID就锁地址,收到WVALID就锁数据,两个都到齐了再拉一次BVALID回写响应;读通道更简单,ARREADY常高,收到ARVALID锁地址,下一拍给RVALID和RDATA。这个骨架写出来大概三四十行,先保证能跑通单寄存器读写,再回头补地址译码,把case里的地址段映射到不同寄存器。顺序反过来,你连验证的锚点都没有。

    平时准备的话,我反而不建议一上来就死磕AXI时序图。时序图信息密度太高,应届生盯着看半天容易陷进去。更有效的路径是手画:拿一张纸,自己把「AWVALID先到、WVALID后到」和「两个同拍到」这两种情况各画一遍波形,画完再对照规范检查,错在哪一目了然。这个动作做两三遍,比读十页文档管用。

    练手顺序按这个递进比较顺:单寄存器只读→单寄存器读写→四五个寄存器的地址译码→加一个只读状态寄存器(这个能逼你想清楚读数据从哪拍出)→再考虑加burst。注意AXI4-Lite本身不支持burst,burst是AXI4 Full的特性,你要是想练burst得切到Full那边去,别在Lite上硬套。这一点很多人搞混,笔试里写出来会扣分。

    最后提醒一句:Lite从机最容易翻车的地方是BVALID和BREADY的握手——主机没ready你不能再发下一次写响应,这个状态得用个flag锁住。你现在的Verilog大概写到什么程度了,状态机是习惯用三段式还是一段式?这个会影响我给你更细的模板建议。

  • 芯片设计小白

    我换个角度说,因为我觉得你卡住的地方可能不是「先写哪个」,而是对握手这件事的心理模型还没建立起来。

    VALID/READY的本质是双向流控:发起方说「我有数据」(VALID),接收方说「我能收」(READY),两者同拍为高才算一次传输。这个模型一旦进脑子,AXI4-Lite的五个通道其实就是五条独立的小传送带,各走各的,互不阻塞。你写过UART和SPI,其实SPI的片选加时钟沿采样也是一种握手,只是它是单向强制的,没有反压概念,所以你没往这个方向想。

    有了这个模型再去看「先写什么」,答案就清楚了:先把每条传送带的单次传输写对,再考虑它们之间的联动。写通道的联动点是「AW和W都到齐才回B」,读通道没有联动点,AR到了就给R。地址译码是在这个框架里往寄存器堆上挂东西,属于最后一步的填充工作。

    所以笔试策略就是:五分钟内把五个通道的骨架铺出来,哪怕译码先写个假的,也要让结构完整。考官看的是你有没有总线思维,不是看你寄存器定义写得多全。

  • 电子技术探索者

    作为经常参与校招筛选的人,我说一下我们这类题实际在看什么,你按这个反推准备顺序会省很多力气。

    第一看握手有没有写对:VALID不能等READY来了才拉高,这是最常见的错;READY可以组合也可以寄存,但要前后一致。第二看写响应有没有漏:AW和W都完成后才发BVALID,且BVALID拉高后要等BREADY才能撤。第三才看地址译码和寄存器读写是否正确。也就是说,骨架分占比远高于译码分。

    所以准备时别把时间平均分配。我的建议是找一份开源的AXI4-Lite从机参考实现(比如网上常见的教学版本),先读懂再默写一遍,重点默写握手部分,译码部分可以简写。默写完自己造几个激励在仿真里跑,看波形对不对。这个闭环做两三次,笔试现场就是肌肉记忆了。

    顺便说个误区:很多同学花大量时间背AXI信号全表,其实Lite从机常用的就那十几个信号,把AWADDR、WDATA、WSTRB、ARADDR、RDATA、Bresp、Rresp这几个吃透就够了。你目前仿真工具用的是Vivado自带的还是ModelSim/Questa?不同工具看波形的习惯不太一样,这个可以后面再聊。

  • 单片机玩家

    我补一个很多人忽略的风险维度:笔试现场最怕的不是不会写,而是写了个「看着像但握手不合规」的从机,自己还觉得稳。常见的坑是BVALID和RVALID用组合逻辑直接由VALID拼出来,仿真波形一跑好像也对,但一旦加了反压就露馅。所以我的建议是,骨架里所有输出到主机的信号(AWREADY、WREADY、BVALID、RVALID)先全部走寄存器打一拍,宁可多一个周期延迟也别省,Lite场景下没人跟你计较那点latency。这样写的好处是时序干净、自己也好推敲,考场上按拍数数着写不容易乱。替代做法也得备一个:如果时间真的只剩十分钟,就写单寄存器最小版本,AW/W常ready、AR常ready、B和R各拉一拍,先保证功能闭环,别硬撑多寄存器译码。另外提醒一句,别把AWADDR和WDATA的到达顺序当成固定先后来设计,这两个通道是独立的,谁先到都合法,你只能靠两个valid都到齐再动作。你平时仿真的时候,有没有试过故意让WVALID比AWVALID早来几拍,看看你的逻辑还稳不稳?

  • 电子小白

    先补一个风险维度吧,很多人栽在「笔试写完自认为对」这件事上。AXI4-Lite从机的握手有个隐蔽陷阱:VALID绝不能等READY来了再拉高,这是协议死规定;反过来READY可以组合也可以寄存,但一旦你选了某种风格,整条通道要前后一致。我见过同学AWREADY用组合、WREADY用寄存,仿真单通道没问题,一联动就出现AW和W到达不同拍、BVALID早发一拍的怪现象。所以考场上我建议你先定死一套风格:所有输出给主机的信号全部打一拍寄存,宁可多一个周期延迟,Lite场景没人计较latency,换来的是时序干净、自己数拍子不容易乱。替代做法也备一个:如果只剩十分钟,写单寄存器极简版,AW/W/AR常ready,B和R各拉一拍,先保证功能闭环。另外别假设AWADDR一定先于WDATA到达,两者顺序不定,你的状态机要能容忍任意先后。平时练的话,我建议手画时序图而不是死盯文档,画一遍AW/W/B的拍数关系,比读十页spec管用。你现在是连单寄存器都没写过,还是写过但握手总对不上?

  • 面向百度

    先说个容易被忽略的点:笔试现场真正拉开差距的不是你会不会写译码,而是你能不能在一张纸上把「哪一拍发生了什么」标清楚。我建议你进场先在草稿纸画两条竖线代表时钟沿,把 AW、W、B 三通道各画一行,然后自己定一个规则:所有发给主机的输出信号统一定在时钟上升沿后变化。这条规则一立,你后面写代码就是照着图抄,不会出现「写到一半发现 AWREADY 拉早了」这种推倒重来。

    风险维度补充一个:很多人栽在复位后的第一拍。AXI4-Lite 从机复位释放后,VALID 可能随时来,但你的状态机如果停在 IDLE 且 READY 没拉高,主机会一直等。所以骨架里 READY 的默认值要想清楚,常高是最省事的做法,但如果你选常高,就别在某个状态下又把它拉低,前后不一致比写错更隐蔽。

    替代做法也备一个:如果时间只剩十五分钟,就写单寄存器极简版,AW/W 常 ready,收到就锁,两个都到齐打一拍 BVALID,读通道 AR 常 ready、下一拍给 RVALID,先让功能闭环,译码用 case 补两三个地址就行。

    你平时练的时候,是打算按单寄存器一路加到 burst,还是先把 Lite 这版默写到不看文档?这个选择会影响你准备节奏。

  • 技术萌芽

    我按一条主线说,就是「先建立流控模型,再谈代码顺序」。你写过 UART 和 SPI,其实脑子里已经有握手了,只是方向不同:SPI 是主机强制推,从机没有反压;AXI 的 VALID/READY 是双向的,发起方说我有数据,接收方说我能不能收,两者同一拍都为高才算一次传输。这个模型立住之后,五个通道就是五条独立的小传送带,各走各的,互不阻塞——写通道唯一的联动点是 AW 和 W 都到齐才回 B,读通道根本没有联动点,AR 来了就给 R。

    有了这个认识,笔试顺序就不用纠结了:先写每条传送带的单次传输,再写通道之间的联动,最后才往框架里塞地址译码。译码本质就是个 case 比较,属于填充工作,你把它放最后,即使时间不够只写一个地址,骨架也是完整的,评分点大部分还在。反过来先写译码,写到一半发现 AWREADY 和 WREADY 时序对不上,前面那堆全得推翻。

    平时准备的递进顺序,我建议按这个走:单寄存器读写跑通,确认 BVALID 拉高后要等 BREADY 才能撤;然后多寄存器加 case 译码;再加 burst——注意 Lite 本身不支持 burst,这一步是给你后面学 AXI4 全协议铺路,可以放到校招之后再补;最后才是乱序和 outstanding,那是进阶内容,笔试基本不考。每一步都手画时序图,比反复看文档有效得多,因为画图会逼你把「第几拍谁拉高」想清楚,看文档容易产生「我懂了」的错觉。

    另外提醒一个学习路径上的取舍:网上开源实现很多,但风格差异大,有的全组合、有的全寄存,你如果东看一份西看一份,容易把两种风格混着抄。挑一份读懂,默写一遍,再自己造激励跑波形,这个闭环做两三次,考场就是肌肉记忆。你目前仿真环境用的是哪套,Vivado 自带还是 Verilator 这类?这会影响你练手时造激励的顺手程度。

  • 芯片爱好者小王

    先把心态放平:AXI4-Lite 从机其实是个「带握手的寄存器堆」,不是新物种。你写过 UART 收发和 SPI 主从,握手的直觉已经有了,只是 SPI 是主机强推、没有反压,而 AXI 的 VALID/READY 是双向的——发起方说我有数据,接收方说我能不能收,同拍都高才算一次传输。这个模型立住,笔试现场就先搭握手骨架、再填地址译码,别反过来。原因很实在:译码就是个 case 比较,属于填充活;真正容易写崩的是 AW/W/B 三个通道的先后关系。先埋头写译码,写到一半发现 AWREADY 和 WREADY 时序对不上,前面全得推倒。最小骨架大概三四十行:写通道 AWREADY、WREADY 先常拉高,AWVALID 来了锁地址、WVALID 来了锁数据,两者都到齐再拉一拍 BVALID 等 BREADY 撤;读通道 ARREADY 常高,收到 ARVALID 锁地址,下一拍给 RVALID 和 RDATA。先保证单寄存器能读写,再回头补译码。你平时练手是用仿真跑波形,还是只对着文档看时序图?

  • CoderBegin

    我按「递进练手 + 一个隐蔽风险」两条线说。

    练手顺序个人感觉最省力的是:单寄存器读写 → 多寄存器加地址译码 → 加 burst(其实 Lite 不支持 burst,这步可以跳过,直接去碰 AXI4 全协议)→ 加乱序和 outstanding。但每一级都别只看文档,手画时序图比看 spec 有效得多:拿张纸画两条竖线当时钟沿,AW、W、B 各一行,自己标哪一拍哪个信号变,画顺了再写代码,写的时候基本是照图抄。

    风险维度补一个很多人栽的点:VALID 绝不能等 READY 来了才拉高,这是协议死规定;反过来 READY 可以组合也可以寄存,但一旦选了某种风格,整条通道要前后一致。我见过 AWREADY 用组合、WREADY 用寄存,单通道仿真没事,一联动就出现 AW 和 W 不同拍到、BVALID 早发一拍的怪现象。所以考场上建议先定死一套:所有输出给主机的信号全部打一拍寄存,宁可多一个周期延迟,Lite 场景没人计较 latency,换来时序干净、数拍子不乱。

    再一个,别假设 AWADDR 一定先于 WDATA 到,两者顺序不定,状态机要能容。时间真只剩十分钟,就写单寄存器极简版,AW/W/AR 常 ready,B 和 R 各拉一拍,先保证功能闭环,别硬撑多寄存器译码。你现在仿真环境是打算用现成的 testbench,还是准备自己从零写激励?

登录后可在本页底部提交回答

提问者

电路板玩家小王查看主页
浏览「其他」

描述场景与已尝试方案,更容易获得有效解答

相关问题

同分类

提问建议

  • 标题写清核心疑问,避免「求助」「请问」等空泛用语
  • 正文补充环境、版本、报错信息或截图
  • 先搜索本站是否已有相近问题,减少重复提问
  • 若与课程相关,请标明课时或章节便于讲师定位