最近准备秋招面试,看到脉脉上有人分享验证岗面试题:用SystemVerilog搭建基于UVM的AXI4-Stream数据流验证环境。我学过UVM基础,但不知道面试官想听什么深度。比如组件怎么划分:driver、monitor、scoreboard各自负责什么?随机约束怎么写才能覆盖所有数据包长度和间隔?有没有标准回答模板?
2026年秋招,数字IC验证工程师面试被问如何用SystemVerilog搭建一个基于UVM的AXI4-Stream数据流验证环境,如何从组件划分和随机约束角度回答?
20 个回答

面试官问AXI4-Stream的UVM环境搭建,其实考察的是你对UVM组件职责和数据流交互的理解。首先,组件划分要清晰,通常包括:一个agent里放driver和monitor,driver负责驱动tvalid/tready/handshake时序,monitor负责采样数据。scoreboard用uvm_analysis_port接收monitor的数据,做数据比对。还需要一个sequencer来管理transaction序列。重点在于tvalid和tready的随机握手,你可以用rand bit控制valid和ready的延迟,比如在driver里用`rand int delay_valid`,约束范围0到10个时钟周期,这样能覆盖不同握手场景。随机约束上,数据包长度用`rand int pkt_len`,约束在合法范围内,比如1到1024字节;包间隔用`rand int idle_gap`,约束在0到100个时钟。面试官可能还想听你如何用constraint_mode控制不同测试用例的约束强度,比如长包测试时关闭短包约束。别忘了说句,monitor里用uvm_analysis_port发data_item给scoreboard,scoreboard里用uvm_tlm_analysis_fifo接收,再配合覆盖组做功能覆盖。这样回答既有代码感,又体现了UVM的组件交互。

这道题我面试时也被问过,感觉面试官想看到你对验证可复用性的思考。组件划分上,建议把driver和monitor放在同一个agent里,但注意AXI4-Stream的握手信号tvalid和tready要独立随机化,不要只固定成always ready。我一般会在driver里用一个循环,产生数据的同时随机拉低valid,模拟背压。随机约束方面,数据包长度建议用randc(循环随机)确保遍历边界值,比如长度等于1、等于最大、等于中间值;间隔用rand配合`dist`分布,比如100个时钟里90%间隔小于10,10%间隔大于50,这样覆盖更全面。面试官可能还想听你如何用factory覆盖机制,比如写一个extended driver来重载约束,或者用uvm_do_with在sequence里直接指定特定包长。另外,别忘了说scoreboard里用uvm_in_order_class_comparator做有序比对,或者自己写一个FIFO比对逻辑,因为AXI4-Stream数据是流式的,要确保数据和顺序匹配。最后可以提一句,你会用uvm_reg_model来配置DUT的寄存器,虽然不是AXI4-Stream直接相关,但能体现系统级思维。

别紧张,这个问题有套路可循,但要注意别只背模板。组件划分方面,核心是driver输出transaction给DUT,monitor捕获DUT输出,scoreboard做数据比对。但AXI4-Stream的特殊性在于它没有地址,只有数据流,所以driver要模拟tvalid/tready的握手,建议用fork-join_none实现并行驱动和随机延迟。随机约束上,数据包长度用rand bit [9:0] pkt_len,约束为1到1024,并加上solve-before顺序来避免约束求解冲突;包间隔用rand int idle_cycles,约束在0到15。面试官可能会追问如何覆盖所有合法握手组合,你可以说用constraint的implication操作符写条件约束,比如当tready为低时,tvalid必须保持高,模拟流水线停顿。另一个隐藏考点是tlast信号,要确保最后一个数据包拉高tlast,并在scoreboard里检查包结束边界。最后,建议你提一句用uvm_verbosity控制调试信息,比如在driver里打印握手时序,这样面试官会觉得你注意实际调试细节。回答时最好画个简单的组件连接图(口头描述也行),把uvm_analysis_port和uvm_tlm_fifo的连线说清楚,这就能拿到大部分分数了。

如果你面试被问到这个问题,面试官其实想看你有没有真正搭过环境、理解数据流验证的核心矛盾。AXI4-Stream和AXI Full/Memory-Mapped最大的不同是它没有地址和握手之外的复杂协议——本质上就是一条流水线,数据持续传输直到TLAST置高。所以组件划分时,关键点是:Driver负责驱动TVALID/TREADY/TDATA/TLAST/KEEP等信号,并实现背压和传输的随机化;Monitor抓取接口上的数据包并封装成transaction给scoreboard;Scoreboard要做数据一致性检查和顺序保证,因为Stream模式可能多个通道交错传输。随机约束方面,你不仅要随机化数据内容,更要随机控制数据包长度(通过TLAST的位置)和间隔(TVALID/TREADY的握手时序,比如用randc来生成TREADY low的周期数,或者用约束让TVALID每2~10个周期拉低一次)。建议你用UVM的`uvm_sequence_item`定义数据包,class里面加入rand bit [31:0] data[]和rand int pkt_len, rand int gap_cycles,然后用constraint块限制pkt_len在1~256之间、gap_cycles在0~15之间。同时别忘了配置AXI4-Stream的KEEP和USER信号,约束它们和数据的关联。面试时如果能把组件职责和随机化策略讲清,再加上一句“我会用uvm_reg_predictor去处理KEEP对齐特殊情况”,就很有深度了。

这题我去年秋招时被问过,当时答得不太好,现在复盘一下。面试官想听的核心其实是:你如何用UVM把一个‘会随机动’的数据流管好。组件划分很简单但容易漏:Driver要模拟发送方行为,包括TLAST多拍拉低导致的突发传输;Monitor则要被动监听,最好用virtual interface抓上升沿变化;Scoreboard重点在顺序检查——如果数据流里只有单个通道,可以用FIFO比较;如果多个通道(比如四个TUSER表示Channel ID),那就要用关联数组。随机约束才是真正亮眼的地方,你不能只想着随机数据内容,更关键的是随机传输时序:用rand bit [3:0] ready_gap来随机化TREADY的拉低周期数,用rand int pkt_len_range约束包长范围,再用rand bit en_tkeep_mask随机化KEEP掩码。别忘了在sequence里把约束写成soft,方便后期通过configuration覆盖。还有一个小技巧:用post_randomize()里做数据包生成,确保TLAST在最后一个有效数据上置位。面试时如果你的回答能提到用uvm_subscriber来桥接monitor和scoreboard,以及用uvm_analysis_port传递事务,面试官会觉得你有实战基础。最后提醒一下,别只说理论,最好能随口举一个你实际调试过的bug,比如包长随机化后TLAST位置错乱导致scoreboard比对失败,这样更有说服力。

面试官问这个,其实是想看你对UVM组件划分和AXI-Stream协议的理解是不是真的到位,而不只是背模板。我建议你先明确AXI-Stream的特点:它没有地址,只有ready/valid握手机制,数据流是连续或间断的。组件划分上,你可以这样分:agent里放driver和monitor,driver负责驱动valid和tdata等信号,同时处理ready的背压;monitor负责采样并转成transaction;scoreboard则通过分析端口接收monitor的数据,并与参考模型或预期结果比对。随机约束方面,核心是覆盖数据包长度和间隔。你可以在transaction里定义rand int pkt_len,用constraint限制范围比如[1:1024]字节;间隔用rand int idle_cycles,约束在[0:10]之间。还可以加一个enable_rand_delay bit来控制是否插入随机间隔。注意面试官可能追问:当ready拉低时怎么处理?你可以在driver里用fork-join_none实现非阻塞等待,或者用一个while循环直到ready为高。最后,建议你画个组件连接图辅助说明,显得更专业。

兄弟,这个题我去年秋招也被问到过,当时没答好,后来复盘了一下。关键点在于面试官想看你有没有实际搭过环境,而不仅仅是看过书。组件划分上,我建议你把monitor拆成两个:一个叫axi_stream_monitor,只管抓信号转transaction;另一个叫coverage_monitor,专门收集功能覆盖率,比如数据包长度、间隔、tuser值等,这样scoreboard就只做比对,职责清晰。随机约束的话,除了长度和间隔,别忘了tkeep和tlast的联动关系:tkeep要随机,但必须保证最后一个beat的tkeep是合法的(比如不是全零),可以用solve before让tlast先随机,再根据tlast来约束tkeep。还有一个坑:面试官可能会问如何模拟背压——你可以在driver里用rand bit backpressure,然后在驱动时随机拉低ready,这样能验证DUT的容忍度。另外,建议你提一句用uvm_sequence来控制发多少个包,以及用uvm_do_with来指定特定边界条件,比如最小长度1字节、最大长度1024字节,这样显得你懂随机化策略。

我觉得回答这个问题,最稳妥的方式是结构化输出,面试官喜欢听分点。先说组件:driver主要职责是驱动valid、tdata、tkeep、tlast、tuser这些信号,并且要配合ready的握手,内部最好用状态机实现idle、send、wait_ready等状态。monitor就反向操作,采样信号并打包成对象,同时用analysis_port广播出去。scoreboard利用uvm_tlm_analysis_fifo接收,然后做数据比对,可能需要处理乱序或延迟。随机约束这块,你可以定义两个随机变量:pkt_len和inter_gap,然后在constraint里写range。为了覆盖边界,建议用soft constraint加权重,比如90%概率长度在[1:64]字节,10%在[64:1024]。另外,间隔可以设为0到5个时钟周期,这样能覆盖连续和断续场景。还有一个加分项:提到使用typedef enum { SHORT_PKT, LONG_PKT, ERR_PKT } pkt_type来分层约束,比如当pkt_type == SHORT_PKT时长度在1-16之间。最后,记得说你会用uvm_verbosity来控制调试信息,以及用uvm_error宏来报错,这样显得代码规范。面试官如果追问参考模型怎么建,你可以说用队列模拟数据流,或者用scoreboard内置的predictor。

面试官问这个,其实是想看你有没有真正搭过环境,而不仅仅是背UVM的组件名字。你先抓住AXI4-Stream的特点:它是连续流,没有地址,只有valid、ready、tdata、tkeep、tlast这些信号,和memory map的协议不一样。组件划分上,我建议你这样说:driver负责驱动transaction级别的数据包,把随机化后的包转成信号时序,尤其是valid和tlast的配合;monitor负责采样信号,恢复成transaction给参考模型和scoreboard;scoreboard只做比对,从monitor拿的预期数据和参考模型的输出比。随机约束的关键在于数据包长度和间隔。长度可以用rand int len,约束len inside {[1:256]}或者根据tlast的位置来定;间隔可以用rand int idle_cycles,约束idle_cycles inside {[0:10]},然后在driver里加入延迟来控制valid拉低的时间。注意,面试官会追问边界情况,比如len=0或len=1,还有间隔为0的back-to-back传输,你最好在约束里加上dist来分配概率,比如len dist {1:=10, [2:255]:=80, 256:=10},显得你有随机覆盖的思维。最后提一句用uvm_sequence机制把随机约束包起来,这样环境可复用。

我面过类似题,核心是让面试官觉得你懂UVM的分层结构,而不只是堆组件。组件划分上,建议按这个思路:先定义一个axi_stream_transaction类,里面包含tdata、tkeep、tlast和长度len,再用rand修饰。然后driver从sequencer拿transaction,通过virtual interface驱动时序,关键在于处理ready信号,可以加一个内部状态机控制valid的拉高拉低。monitor反过来,把时序抓成transaction,并收集覆盖率。scoreboard用uvm_in_order_class_comparator或者自己写一个,比较时注意tkeep的字节有效掩码。随机约束你得突出覆盖全面:长度约束为1到最大包长,用if条件确保tlast只在最后一个数据有效;间隔约束用rand int gap,范围0到10,并在driver里用repeat循环延迟。另外,建议加一个constraint_mode来控制是否随机间隔,方便回归测试。面试官会期待你说出如何用UVM的objections机制控制仿真结束,以及怎么用config_db传递interface和参数。你可以说把包长和间隔的随机权重放到外部配置类里,这样环境更灵活。最后强调一句,验证环境写完后,跑几个带断言(assertion)的波形检查,比如用assert property检查tlast后下一个data必须valid为低,能让面试官印象深刻。
发表回答
登录后可在本页底部提交回答