2026年FPGA校招,面试官问Verilog实现一个基于AXI4-Stream的实时视频缩放,双线性插值行缓冲深度怎么算?求具体推导和边界处理

开放8 回答 59 浏览

最近在准备2026年FPGA校招,刷到很多面经提到手撕Verilog实现AXI4-Stream实时视频缩放。我卡在双线性插值的行缓冲深度计算上,面试官追问边界像素怎么填充才能不丢帧。有没有大佬能给出具体推导公式和边界处理代码?比如输入1080P、输出720P时,行缓冲需要存几行数据?边界处是补零还是复制像素?

分享:

8 个回答

  • 数字IC菜鸟

    面试官问这个其实是想看你对插值坐标映射和行缓存周转有没有直觉。双线性插值需要相邻两行像素,所以行缓冲深度至少是2行。但关键是要看你的处理流水线:如果输入数据是逐行扫描且AXI4-Stream不能暂停,那你就得用两行乒乓缓冲,一行在读、一行在写,深度就是2行。边界处理上,一般用复制边缘像素,也就是最左和最右列向外多取一次本列的值,这样实现简单且视觉上不会出现黑边。补零会让边界产生渐变黑条,除非你有特殊要求否则不推荐。你是在用Xilinx还是Intel的器件?他们自带的行缓冲IP可以直接调用,但手撕时建议自己写个双口RAM控制。

  • 代码小白

    行缓冲深度推导其实分两步。第一,双线性插值每次需要4个像素,但垂直方向上只需要当前行和下一行两行数据,因为水平方向用流水线寄存器缓存相邻像素就够了。所以行缓冲深度理论上等于2行,但实际工程中要考虑视频时序的消隐期:如果输入是连续流(比如每时钟一个像素),行缓冲必须能在写新行的同时读旧行,这通常用双口RAM实现,深度就是一行像素数乘以2。第二,边界处理最稳妥的做法是复制像素:当插值核落到图像边缘时,把坐标钳位到[0, width-1]和[0, height-1]之间,这样相当于用边缘像素填充。补零会导致边缘出现暗边,在视频应用中很扎眼。另外注意,缩放比例不是整数时,行数计算要向上取整,比如1080P到720P垂直缩放因子是0.667,每一输出行需要读1.5个输入行,所以行缓冲至少存2行才能覆盖最坏情况。你写代码时可以用一个状态机控制读地址偏移,避免多读或少读。追问一下:你打算用FPGA内部BRAM还是用外挂DDR来实现行缓冲?这会直接影响深度选择。

  • 码电路的阿明

    这个问题其实有两个坑,很多面经只讲了一半。第一个坑是行缓冲深度到底等于几行?很多人直接说2行,但实际面试官会追问:如果输入是1080P(1920×1080)输出720P(1280×720),缩放因子在水平和垂直方向都是0.667,那么每输出一行需要从输入行中插值得到。双线性插值在垂直方向上需要当前行和下一行,所以至少缓冲2行。但注意,当缩放因子不是整数时,输出行对应的输入行号可能是1.5、2.3这种小数,这时候你需要在两行之间做插值,且下一行数据必须在当前行处理完之前到达。如果输入流没有间隙(比如每个时钟都有效),那么你必须用双口RAM做乒乓操作:一个端口写当前行,另一个端口读上一行和当前行。深度就是一行像素数,但需要2行容量,即1920个像素乘以2,每个像素如果是8位则3840字节。第二个坑是边界处理。面试官真正关心的是你怎么在硬件里实现坐标钳位而不产生气泡。常用的做法是在读地址生成时加一个比较器,如果像素坐标小于0则取0,大于最大值则取最大值。这样相当于复制边缘像素。注意,复制操作要在同一时钟周期完成,否则会引入流水线气泡导致丢帧。如果你用Verilog写,通常会在插值核前加一个边界处理模块,把输入的坐标和像素值做映射,然后再送进乘法器。还有一个容易被忽略的点:AXI4-Stream的tready/tvalid握手信号必须正确处理,当行缓冲未准备好时,要拉低tready反压上游,否则会丢数据。你可以在仿真里故意让上游连续发送,检查你的设计是否能把所有像素都存下来。建议你在写代码前先画一个数据流时序图,把每个时钟周期写地址、读地址、插值系数变化都标出来。你目前用的是什么仿真工具?Vivado自带的仿真器够用,但如果要测边界情况,建议用SystemVerilog写一段随机激励。另外,面试时可能会让你直接在白板上画出行缓冲的地址生成逻辑,你最好把双口RAM的读写使能时序也讲清楚。如果你手头有学校项目,可以把视频缩放的实现放到毕设里,这样面试时能拿出实物演示。最后提醒一句:别死记硬背代码,面试官更看重你推导深度的方法和应对反压的思路。你目前Verilog能独立写多少行的模块了?

  • 单片机爱好者

    个人感觉面试官真正想考的是你对行缓存周转和边界条件的理解,而不是死记公式。以1080P缩到720P为例,垂直缩放因子0.667,输出每行需要从输入行里插值,最坏情况下一输出行可能要用到输入的第n行和第n+1行,所以行缓冲深度最少是2行。但实际工程中,AXI4-Stream如果连续不断流,你必须用双口RAM做乒乓,一行写一行读,深度就是1920个像素乘以2。边界处理上复制边缘像素比补零更常用,因为补零会让边缘出现暗色渐变,在视频里特别明显。你写Verilog时,控制好地址钳位和写使能就行,不用搞复杂。

  • 嵌入式学习ing

    这里有个容易被忽略的点:行缓冲深度跟输入流是否有消隐期强相关。如果输入是纯数据流、没有行间隔,那两行乒乓是唯一的解法——深度就是一行像素数乘2。但如果AXI4-Stream的tuser或tlast能标记行尾,且视频源有消隐期,其实可以用单行RAM加双端口,在消隐期内完成行切换。不过校招面试官通常不会考这么细,他们更想看到你能画出乒乓框图并解释清楚两行如何交替读写。边界处理上,复制像素是最稳妥的,实现时只需要在读写地址上加钳位逻辑:当坐标小于0时用0,大于最大值时用最大值。补零虽然数学上简单,但会导致边缘像素值陡降,缩放后图像最外圈会有一圈黑边,这在视频处理中基本不可接受。你可以准备一个小例子:比如模拟一个4×4图像缩到2×2,手算一遍插值系数和边界像素取值,面试时能说得更清楚。对了,你用的是Xilinx的HLS还是纯RTL?不同工具链对行缓存的优化思路不太一样,这个也可以提前想想怎么回答。最后追问一句:你目前是用Vivado的IP核还是自己写代码?这会影响面试官后续问题的方向。

  • 芯片萌新

    行缓冲深度说白了就是看你输入有没有行间隙。如果AXI Stream每拍都有效、没有消隐期,那必须乒乓两行,深度就是19202个像素。边界建议直接复制边缘像素,补零会在缩放后留一圈黑边,面试官一眼就能看出来你没实际调过视频。

  • Verilog入门

    个人觉得面试官真正想听的不是你背出深度等于2行这个结论,而是你怎么从缩放因子推到行缓存深度。以1080P缩到720P为例,垂直缩放因子是720/1080=2/3,意味着每输出一行要读1.5个输入行。最坏情况下一输出行同时依赖输入的第n行和第n+1行,所以至少需要2行。但如果你用的双口RAM,两个端口能同时读写,深度就是一行像素数。边界处理上我建议用复制,代码实现时只要在地址计算上加饱和截位:当x坐标小于0时取0,大于1919时取1919。面试时你可以顺手画个读写时序图,把写使能、读地址和行切换逻辑标清楚,这比光靠嘴说更有说服力。另外提醒一点,AXI4-Stream的tuser信号如果带有帧同步和行同步,那行缓存深度可以省成1行加几个寄存器,因为可以在消隐期做行切换。不过校招面试一般不会考这么深,你先把乒乓和边界钳位讲透就够用了。

  • Python学徒

    给你一个更工程化的视角吧。行缓冲深度推导分两步走:第一步根据插值算法确定垂直方向需要几行。双线性插值需要当前行和下一行,所以至少2行。第二步看输入流特性——如果AXI4-Stream的tvalid一直为高,没有行消隐,那两行缓冲必须同时工作,一行写一行读,深度就是一行像素数乘以2。但如果你的设计里有帧缓存DDR,或者输入流自带行间隔(比如每行最后一个像素拉高tlast后停几个时钟),那单口RAM加地址切换就能糊弄过去,深度只需一行再加几个寄存器做流水线。边界处理我建议你分场景说:面试时先说补零数学上最简单,然后立刻转折——实际视频处理里补零会导致边缘像素陡降到0,缩放后最外圈出现暗色渐变,所以工业上基本都用复制像素。你可以准备一个4×4缩到2×2的手算例子,把边界像素的插值系数和取值过程完整算一遍,面试官就能看到你对坐标映射和地址钳位都心里有数。还有个小技巧:用Verilog实现时,横向边界用地址饱和截位,纵向边界直接让行地址比较器输出上一行的数据作为下一行,这样不会增加额外延迟。你目前是在用Vivado的HLS写还是纯Verilog?这个会决定你行缓存是用BRAM还是寄存器堆,性能差别挺大的。最后提醒一句:校招面试很少要求你现场写出完整的双线性插值模块,更多是看你能不能把乒乓操作、地址生成和边界条件这三点串起来讲通。你练手的时候可以对着Vivado的仿真波形,把每一拍的行号、列号和读写地址都画出来,跟推导的理论值对比,这样印象最深。

登录后可在本页底部提交回答

提问者

逻辑电路新人查看主页
浏览「其他」

描述场景与已尝试方案,更容易获得有效解答

相关问题

同分类

提问建议

  • 标题写清核心疑问,避免「求助」「请问」等空泛用语
  • 正文补充环境、版本、报错信息或截图
  • 先搜索本站是否已有相近问题,减少重复提问
  • 若与课程相关,请标明课时或章节便于讲师定位