2026年FPGA秋招面试,面试官让我手撕Verilog实现AXI4-Stream的实时RGB转灰度,要求支持1080P60帧。我写了一个简单的乘法加法流水线,但面试官追问说流水线深度怎么设计才能避免数据冒险和丢帧?还问了行缓冲要不要用,以及像素时钟和系统时钟不同步怎么处理。求大佬分享具体的设计思路和代码结构,面试时怎么回答才能拿高分?
2026年FPGA秋招,手撕Verilog实现一个基于AXI4-Stream的实时RGB转灰度,面试官问流水线深度怎么设计才能不丢帧?
10 个回答

先说面试官真正在考察的点。1080P60的像素时钟大概148.5MHz,你写个简单的乘加流水线,三个周期出结果,在148.5MHz下时序没问题,但面试官追问流水线深度,其实是在看你对AXI4-Stream握手机制的理解是否到位。丢帧不是流水线深度本身造成的,而是上游valid-ready握手时,你的处理模块能不能在任意周期暂停。如果你只做了三级流水线,但中间每一级都只靠寄存器打拍,没有考虑ready反压,那当下游反压时,你的流水线里还有数据在跑,等ready回来时已经丢帧了。正确的思路是:流水线的每一级都要有valid-ready的本地握手逻辑,或者用fifo来解耦。对于RGB转灰度这种纯组合加两级寄存的运算,我更倾向在输入侧放一个depth=4的async fifo,输出侧也放一个depth=4的fifo,中间运算部分全寄存器打拍,运算深度就是固定的2拍或3拍,不依赖握手信号。这样只要fifo不空且不满,就能稳定每时钟出一个结果,不会丢帧。行缓冲的问题:如果你只做一行的灰度转换,完全不需要行缓冲,因为RGB转灰度是逐像素独立的。面试官问行缓冲,可能是在引导你考虑后续是否要加2D滤波,或者他其实想问的是你如何保证一行结束时的时序正确。你可以直接回答:对于单像素运算,不需要行缓冲,但如果你要求我实现某些依赖邻域像素的算法,那我会用BRAM做行缓冲,深度为一行像素数。像素时钟和系统时钟不同步:这个在1080P60场景下很常见,因为FPGA可能用200MHz系统时钟,而像素时钟是148.5MHz。处理方法就是用async fifo做跨时钟域,深度至少4,写时钟用像素时钟,读时钟用系统时钟,同时注意gray码指针同步。面试时拿高分的关键是:先画一个简单的架构框图,标出fifo位置和流水线级数,然后解释为什么选这个深度,最后用一句话总结——只要保证每个时钟周期都能处理一个像素,且反压只发生在fifo满的时候,就不会丢帧。对了,你用的FPGA型号是什么?如果是7系列,148.5MHz的时序其实很宽松,不用太担心。
丢帧跟流水线深度没关系,跟你的反压处理有关系。你只要在输入输出各放一个fifo,中间运算固定两拍,哪怕下游每四个周期才ready一次也不会丢。面试官问流水线深度是挖坑,你跳进去就输了。
我个人觉得你被面试官带偏了。他问流水线深度怎么设计才能不丢帧,其实正确答案是:流水线深度不影响丢帧,影响丢帧的是你模块的back-pressure处理能力。RGB转灰度这种逐像素运算,你完全可以把整个设计做成一个纯组合逻辑加两级输出寄存器,然后靠输入侧的async fifo来吸收时钟域差异和下游反压。关键在于你的握手信号要穿过运算级,也就是每一级都要有valid和ready的传递,或者像更常见的做法,在输入fifo之后直接做运算,运算结果进输出fifo,中间不插握手。这样流水线深度就是固定的两拍或三拍,只要fifo深度足够覆盖最大反压周期数,就不会丢帧。至于1080P60,148.5MHz下你的fifo深度选8就绰绰有余了,因为反压一般不会超过一个像素时钟周期。你当时有没有问他系统时钟频率是多少?如果系统时钟比像素时钟高,那其实可以用系统时钟做运算,像素时钟只做采样,这样还能省一个fifo。

面试官追问流水线深度和丢帧的关系,其实核心不在深度本身,而在你的流水线有没有处理好AXI-Stream的valid-ready握手机制。你写一个三级乘加流水线,每级只靠寄存器打拍,看起来时序漂亮,但一旦下游反压(比如输出fifo快满了,ready拉低),你的流水线里还有正在运算的数据在前进,等ready恢复时这些数据已经冲出去了,输入侧的新数据又可能被覆盖,这就丢帧了。正确的做法是:每一级流水线的寄存器都要有本地valid-ready逻辑——当前级valid为高且下一级ready为高时,数据才向前传播;否则当前级数据保持。对于RGB转灰度这种组合逻辑占用大的运算,更常见的工程做法是在输入侧放一个depth=4或8的sync fifo来吸收反压,输出侧也放一个depth=4的fifo,这样流水线内部的寄存器可以简化成纯打拍,由fifo的full/empty信号来控制上游的ready。至于行缓冲,1080P60下RGB转灰度不需要行缓冲,因为每个像素的灰度值只依赖当前像素的RGB,不依赖邻域。但如果后续要做边缘检测或滤波,那就需要至少一行缓冲了,面试官提行缓冲可能是想看你有没有考虑扩展性。像素时钟和系统时钟不同步的问题,你直接回答用异步fifo跨时钟域,depth根据最坏情况下的读写速率差来算,一般depth=8对1080P60足够。面试时建议先画出你的流水线握手状态机,再解释为什么不用行缓冲、为什么这样设计能保证不丢帧。另外,面试官也可能想听你提一下tuser/tlast信号的处理,比如帧首信号要对齐到第一个像素,否则灰度输出和原始帧会错位。你现在的代码里有没有考虑tuser的同步打拍?这个细节往往能拉开差距。

流水线深度跟丢帧没关系,丢帧是反压没处理好的锅。你只要在输入加个depth=4的sync fifo,输出加个depth=4的fifo,中间流水线随便打几拍都不会丢。面试官问行缓冲,八成是想看你有没有考虑后续扩展,直接说当前像素级运算不需要就行。

面试官真正想听的是你对AXI4-Stream握手机制的理解,而不是流水线深度本身。你写三级流水线,但每一级如果没有实现valid-ready的本地握手,当下游反压时数据就会在流水线里乱跑,重新ready时要么丢帧要么数据错位。正确的做法是:在输入侧放一个depth=4的sync fifo来吸收反压,输出侧也放一个depth=4的fifo,这样中间流水线可以简化成纯打拍,由fifo的full/empty信号控制上游ready。行缓冲对纯RGB转灰度不需要,因为每个像素独立运算。像素时钟和系统时钟不同步就用异步fifo跨域。面试时建议画出握手状态机,再强调tuser/tlast信号要对齐到第一个像素,这个细节很加分。你现在的代码里tuser是怎么同步的?

面试官问流水线深度,其实是在试探你对握手机制有没有真正理解,而不是真的要你背一个深度数字。我自己做视频处理时碰到过类似场景,1080P60下像素时钟148.5MHz,如果你用三级乘加流水线,每级只靠寄存器打拍,时序确实能过,但一旦下游反压(比如输出FIFO快满了,ready拉低),数据就会在流水线里乱跑。等ready恢复,前面冲出去的数据已经丢了,新来的像素又覆盖了旧数据,画面就出花屏。正确的做法是:输入侧放一个depth=4的同步FIFO来吸收反压,输出侧也放一个depth=4的FIFO,中间流水线可以简化成纯打拍,由FIFO的full/empty信号控制上游ready。这样流水线深度本身不丢帧,丢帧是因为没有本地valid-ready握手。面试时你画个握手状态机,再强调tuser和tlast要对齐到第一个像素,这个细节很加分。行缓冲对RGB转灰度不需要,因为每个像素独立运算。像素时钟和系统时钟不同步就用异步FIFO跨域。你现在的代码里tuser是怎么同步的?这个信号很容易被忽略,但面试官经常盯着问。

我感觉很多备战的应届生容易把流水线深度当成一个孤立的数字来背,比如'三级流水线够了'或者'五级更安全',但面试官真正想听的是你理解数据流在反压场景下的行为。我当年面一个做图像加速的部门时,面试官直接让我在白板上画AXI4-Stream的valid-ready时序,然后问:如果下游ready在第三拍拉低,你流水线第二级的数据会怎样?如果这时候tuser和tlast没对齐,输出端怎么恢复帧边界?这几个问题比单纯问深度刁钻得多。回到RGB转灰度这个具体问题,1080P60其实不算高频,148.5MHz在7系列FPGA上用三级组合逻辑加两级寄存器就能过时序。但面试官追问丢帧,关键点在于你的流水线有没有实现每级内部的valid-ready握手。一个常见的工程做法是:把流水线拆成两个FIFO夹一个组合逻辑块——输入FIFO负责吸收上游突发的反压,输出FIFO负责平滑下游的背压,中间的组合逻辑只做乘加运算,用寄存器打一拍输出valid。这样流水线深度就是1拍(组合逻辑的寄存器输出),但实际延迟是FIFO深度加运算延迟,数据却不会丢。面试时你还可以主动提一句:如果后续要扩展成彩色转灰度的gamma校正或者直方图均衡,那时候才需要行缓冲,因为那些算法依赖相邻行的像素。现在只做RGB转灰度,行缓冲是多余的,但说出这个区分能体现你的扩展性思考。像素时钟和系统时钟不同步的问题,直接说用异步FIFO跨域,depth选2的幂次,比如8或16,留够裕量。面试官如果追问异步FIFO的空满判断怎么避免亚稳态,你就说用格雷码加两级同步器,这是标准做法。我建议你在面试前自己搭一个完整的小模块,用Vivado或者QuestaSim跑一下带反压的仿真,看到波形里tready拉低时tvalid和tdata有没有保持,这个经验比背八股文有用得多。你当前写代码时用的是哪种FIFO IP?Xilinx的原语还是自己写的双口RAM?

面试官问流水线深度,其实是在看你对AXI4-Stream valid-ready握手的理解能不能落到代码里。1080P60下148.5MHz,你写三级乘加流水线每级加寄存器打拍,时序能过,但没处理反压的话下游ready一拉低就丢数据。我建议你在输入侧放一个depth=4的同步FIFO,输出侧也放一个depth=4的FIFO,中间流水线简化成纯打拍,由FIFO的full/empty控制上游ready。这样深度本身不丢帧,丢帧是因为没有本地握手。你现在的代码里tuser信号是怎么对齐到第一个像素的?

手撕代码时别一上来就写流水线,先画个握手状态机给面试官看。RGB转灰度每个像素独立运算,行缓冲当前不需要,但面试官问这个八成是想看你有没有考虑后续扩展——比如你后面要加sobel边缘检测就得用行缓冲了。像素时钟和系统时钟不同步,用异步FIFO跨域,depth设4到8就够,别设太深浪费资源。流水线深度我推荐两级:第一级做乘法(R0.299之类),第二级做加法并寄存输出,这样组合逻辑延迟小。关键是在每一级寄存器前加valid-ready逻辑:当前级valid为高且下一级ready为高才打拍,否则保持。面试时你把这个状态机画清楚,再强调tlast要跟最后一个像素对齐,分数就不会低。你做的乘法系数是定点数还是浮点数?

说一个面试官没明说但很在意的点:他追问行缓冲,可能是在试探你对视频流数据依赖性的理解深度。RGB转灰度确实是像素级运算,每进来一个像素独立出结果,理论上不需要行缓冲。但如果你后续想扩展成双边滤波、高斯模糊这类需要邻域信息的算法,行缓冲就是瓶颈。面试时你可以这么答:当前设计用不到行缓冲,因为每个像素只依赖当前输入,但如果面试官希望看到可扩展性,可以提一句预留行缓冲接口或者把设计模块化,将来加kernel运算时只需要在输入侧插一个line buffer IP核就行。这样既回答了问题又显得有工程视野。关于流水线深度,我更倾向于面试官真正关注的是你能否在代码里把valid-ready握手机制做到位,而不是背一个数字。一个常见的工程陷阱是:你写了三流水线,但每级只靠寄存器打拍,没有valid-ready逻辑,那么当下游反压时——比如输出FIFO满、ready拉低——流水线中间级的数据还在往前跑,等ready恢复时这些数据已经冲出去了,输入侧新来的像素又覆盖了旧数据,画面就出现花屏或丢帧。正确做法是让每一级流水线寄存器都受valid与ready控制:数据只在valid=1且ready=1时才更新,否则保持。对于1080P60这个频率,你还可以用vivado的时序报告来验证,确保setup slack为正。最后提醒一点:面试官问像素时钟和系统时钟不同步怎么处理,你回答用异步FIFO跨域时,最好具体说清楚读时钟域和写时钟域的深度怎么算,以及怎么处理空满标志的跨时钟域同步。你可以反问面试官一句:你们项目的系统时钟是直接给像素时钟还是做了动态变频?这个细节能体现你对实际工程场景的思考。

面试官追问流水线深度和丢帧的关系,其实他真正在意的不是你把深度设成2还是3,而是你有没有意识到:纯打拍流水线在AXI-Stream协议下如果不加valid-ready本地握手,反压一来数据就会错位。RGB转灰度这个运算,每个像素独立,组合逻辑主要在三路乘法和一级加法。1080P60下148.5MHz,如果你的目标器件是7系列或更新的FPGA,两级寄存器夹在乘法和加法之间就能过时序,没必要硬塞三级。但前提是每级寄存器前都要有valid-ready逻辑:当前级valid为高且下一级ready为高时,数据才被捕获到下一级;否则本级数据保持。面试时你画个时序图,把ready拉低后流水线里数据停住、不丢失的过程演示出来,比单纯说深度等于多少分高得多。至于行缓冲,现阶段用不上,但你可以主动提一句:如果后续要加sobel或高斯滤波,会在输入侧预留line buffer接口,模块设计成可插拔的。像素时钟和系统时钟不同步,用异步FIFO跨域,depth设4到8够用,因为像素流是连续的,反压时长一般不会超过一个行消隐周期。你写代码时tuser和tlast信号要跟着数据流一起打拍对齐,面试官看到你把帧同步信号也纳入流水线管理,会认为你具备完整的数据通路设计意识。你目前用的乘法系数是定点数还是浮点数?这个选择会影响流水线级数和资源消耗。
发表回答
登录后可在本页底部提交回答