2026年FPGA校招笔试题:手撕Verilog实现一个基于AXI4-Stream的实时Canny边缘检测,非极大值抑制的流水线怎么设计才能满足1080P60?

开放10 回答 54 浏览

正在准备2026年FPGA校招,看到很多面经都在问AXI4-Stream实时图像处理。Canny边缘检测的非极大值抑制部分,需要比较梯度方向上相邻像素,这怎么用流水线设计才能不丢帧?面试官特别强调要支持1080P60,时序要求很严格。有没有大佬能分享一下具体的流水线架构,比如梯度方向怎么并行处理,边界像素怎么填充,还有行缓冲深度怎么算?求详细解答。

分享:

10 个回答

  • 电子爱好者初级

    说实话,1080P60的实时Canny,非极大值抑制那块最坑的不是算法本身,而是边界处理。面试官大概率是想听你说怎么用行缓冲+状态机做边界镜像填充,直接说用2个行缓冲做3×3窗口就够了,梯度方向并行比较用case语句拆成四个象限,没必要搞太花哨,时序过不去都是白搭。你目前用的工具是Vivado还是Quartus?

  • 芯片初学者

    个人感觉,校招面这题不用真把完整代码背下来,重点是把流水线级数说清楚。非极大值抑制本质上是个3×3窗口内的方向比较,你可以这么拆:第一级收数据,把AXI-Stream转成像素流,同时开一个深度至少1920+2的行缓冲(1080P一行1920像素,缓冲存两行半就够了),第二级做梯度幅值和方向计算,第三级才是非极大值抑制。抑制那块用查表法把梯度方向量化到0/45/90/135度,然后并行比较中心像素和它正反方向的邻居。时序紧张的话,把比较结果打一拍再输出,这样整体流水线大概6-7级,1080P60的像素时钟也就148.5MHz,7系列FPGA完全扛得住。追问一句:你准备用纯Verilog还是HLS?面试官对不同工具的容忍度差挺多的。

  • 回车新人

    从一个在职做视频处理的角度看,校招能问到这个深度,大概率是看你有没有工程意识,不是真让你上板调。非极大值抑制的流水线设计,除了楼上说的行缓冲和方向量化,还有一个容易翻车的地方:梯度方向计算和幅值计算之间的数据对齐。Sobel算子和CORDIC出方向需要时间,但非极大值抑制必须同时拿到当前像素的幅值和它的邻居幅值,所以你要用移位寄存器把幅值延迟若干拍,等方向算出来再一起送进比较器。这个延迟拍数取决于你方向计算的流水深度,一般是3-5拍。边界填充的话,1080P60建议用双端口BRAM做行缓冲,深度取1920,宽度12位(幅值8位+方向4位),这样比用分布式RAM省LUT。另外,面试官提到不丢帧,其实只要你的AXI-Stream握手逻辑写对——valid和ready的时序不打架,数据不会漏。一个常见的坑是有人为了省资源把ready信号乱接,导致backpressure没处理好,帧尾丢像素。你不如准备一个简单的握手状态机模板,面试时直接画出来,比空谈架构更有说服力。顺便问下,你Sobel算子和CORDIC的方向实现是用的IP核还是手写的?这个选择会影响流水线级数的预估。

  • 单片机新手

    校招能聊到这个深度,说明面试官在试探你对数据流时序的理解。非极大值抑制的流水线核心就一句话:让梯度幅值和方向在时间上对齐。你用Sobel算完幅值,再用CORDIC或者查表算出方向,这中间差了好几拍。解决办法很简单——在幅值路径上插移位寄存器,延迟到方向算出来那一刻,再一起送进比较器。行缓冲深度按1080P算,至少两行加一个像素,也就是19202+1。边界用镜像填充,状态机控制边界处的像素复用就行。你目前手头有现成的Sobel模块吗?

  • FPGA自学者

    很多人一上来就纠结非极大值抑制的算法细节,其实面试官更想听你怎么解决1080P60的实时性问题。我给你拆一个实际项目里验证过的流水线,一共七级。第一级,AXI-Stream转像素流,同时用两个BRAM做行缓冲,深度1920,宽度设成12位就够了——幅值8位加方向4位,别浪费位宽。第二级,3×3窗口生成,用移位寄存器把三行数据对齐,这里注意边界像素的处理:我见过有人直接补零,结果边缘出现假边缘,面试官一眼就能看出来你没做过图像处理。正确做法是用状态机判断当前像素是否在图像边界,如果在,就复制相邻像素做镜像填充。第三级,Sobel算子和梯度方向计算并行做,方向用查表法量化到0、45、90、135四个象限,查表比CORDIC省LUT,时序也更好走。第四级到第六级就是非极大值抑制的核心:先把幅值延迟3拍等方向算出来,然后并行比较中心像素和它正反方向的两个邻居,比较结果用组合逻辑直接出,不用打拍,因为下一级会做阈值化处理。第七级,双阈值判断和边缘连接,这里可以用一个简单状态机做滞后阈值。整条流水线在1080P60下,像素时钟148.5MHz,在Artix-7上都能跑满,关键是行缓冲的读写时序要跟valid/ready握好手,别让backpressure把数据堵死。追问一句:你准备用纯Verilog写还是打算用HLS?面试官对HLS的接受程度差异很大。

  • 数字电路学习者

    补充一个容易被忽略的点:梯度方向量化。很多人用atan2把方向算成浮点再四舍五入,这在FPGA上既浪费资源又影响时序。实际工程里直接用Sobel的两个梯度值Gx和Gy做象限判断——如果Gx和Gy同号且Gx大于Gy,方向就是45度;Gx大于Gy且异号,135度;依此类推。这样只需要几个比较器,不用开根号也不用除法。另一个坑是AXI-Stream的tlast信号处理:1080P60每帧19201080个像素,tlast在每行最后一个像素拉高,很多人忘了在行缓冲写地址计数里用tlast做行同步,导致行缓冲写地址溢出丢帧。你可以在状态机里加一个行计数器,每收到tlast就加一,同时把写地址清零,这样就不会错位。个人建议校招前找个开源Canny项目跑一下仿真,把波形里valid和ready的对齐关系看清楚,面试的时候能说清楚这个细节就很加分了。

  • 嵌入式爱好者小王

    面试官问非极大值抑制的流水线,其实想听的是你如何处理数据流中的时序错位。一个常见风险是:你用Sobel算完梯度幅值后,再用CORDIC或atan2去算方向,方向出来时幅值已经过了好几个时钟周期,直接比较就会对不上像素。解决方法是给幅值路径插入移位寄存器,延迟到方向算完那拍再一起送比较器。另一个坑是行缓冲写地址溢出——如果只依赖tlast复位写地址,但valid/ready握手导致tlast被拉低一拍,写地址就会多跳一次,造成行数据错位。我自己做过的一个方案是加一个行计数器,每收到tlast就加一,同时用一个标志位锁存行结束信号,等下一行第一个像素的valid到来时再清零写地址,这样握手再乱也不会丢帧。边界填充方面,镜像复制比补零好用,但状态机要小心边界像素的3×3窗口生成,别把无效数据算进去。你目前手头有现成的仿真环境吗?可以先搭一个像素生成器,用随机valid/ready测试握手逻辑的稳定性,很多hidden bug跑几万帧就暴露了。

  • aipowerup

    校招能问到AXI-Stream实时Canny的流水线,说明面试官在考察你对数据流控制的工程直觉,而非仅仅算法理解。非极大值抑制的瓶颈不在于比较逻辑有多复杂,而在于梯度方向的计算延迟打乱了数据的自然对齐。我的建议是:把方向量化到四个象限(0/45/90/135),用查表法代替CORDIC或除法,查表只需要几个LUT,延迟固定为1个时钟周期,这样你只需要给幅值路径补1拍延迟就能对齐,整个流水线可以压缩到5级左右。行缓冲深度按1080P算,至少存两行半——也就是19202+1个像素,用双端口BRAM实现,位宽设成12位(幅值8位+方向4位),这样比分开存两个RAM省资源。边界填充用镜像复制,状态机根据当前像素坐标判断:如果在第一行,复制第二行的像素;如果在最后一行,复制倒数第二行的;左右边界同理。注意,这种判断不能放在关键路径上,最好提前一拍算好边界标志,直接送给窗口生成模块。面试官提到不丢帧,其实AXI-Stream的tready信号处理很关键——你的模块必须在tready为低时能缓存数据,否则上游一停你就丢。一个稳妥的做法是内部加一个FIFO深度至少为16,当FIFO半满时拉低tready反压上游,这样即使下游处理慢半拍也不会丢数据。另外,梯度幅值的位宽选择也有讲究——Sobel算出来幅值最大是1020(2554),用10位就够了,但后续非极大值抑制比较时需要差值运算,建议保留到11位,避免溢出造成假边缘。你可以在校招前用Vivado跑一个简单的Canny工程,重点看时序报告里WNS和TNS的数值,如果148.5MHz走不通,可以考虑在幅值比较路径上插入流水寄存器,一般补1到2级就能收敛。

  • Verilog小白学逻辑

    流水线设计说白了就是给数据排队,非极大值抑制那点比较逻辑根本撑不住148.5MHz,瓶颈全在行缓冲的写地址管理和方向延迟对齐上。你只要保证梯度方向算出来时幅值刚好等在那里,边界用镜像填充别偷懒,基本就过了。追问一句:你准备用纯Verilog还是HLS?面试官对HLS的容忍度普遍更低,纯Verilog更稳。

  • 逻辑电路初学者

    说实话,校招能聊到非极大值抑制的流水线,面试官大概率不是在等你默写某本教材的框图,而是想听你讲清楚一个工程上的取舍:方向量化怎么省资源,同时不丢精度。

    很多人一上来就提CORDIC或者查表,但忽略了一个更实际的问题——1080P60的像素时钟148.5MHz,如果你用纯组合逻辑做方向判断,时序很难收敛。我见过一个可行的做法是:把Sobel算出来的Gx和Gy直接送进一个四象限比较器,只判断符号和绝对值大小,输出两位编码(0,1,2,3对应0/45/90/135度)。这个比较器本身只有两级逻辑,打一拍输出,延迟固定为1个时钟。然后你在幅值路径上补1拍延迟,这样方向和数据就能对齐,整个非极大值抑制的流水线可以压缩到5级以内。

    另一个容易被忽视的坑是边界填充的状态机实现。很多人用像素坐标来判断是否在边界,但坐标计算本身有延迟,容易和行缓冲的写地址不同步。一个替代做法是:在行缓冲的读端口做镜像,读取时根据当前行号自动决定是读真实像素还是复制相邻行像素。这样状态机只需要维护一个行计数器,逻辑简单很多。

    你目前是在用仿真验证过Sobel模块,还是直接开始写整个Canny?如果有现成的行缓冲模块,建议先跑一下边界情况下的波形,看看tlast和tready握手时写地址会不会多跳一次。

    追问一句:你面试时被问过AXI-Stream的tuser信号怎么处理吗?很多校招题会要求每帧起始打标记,这个在Canny流水线里也挺关键的。

登录后可在本页底部提交回答

提问者

代码小萌新查看主页
浏览「其他」

描述场景与已尝试方案,更容易获得有效解答

相关问题

同分类

提问建议

  • 标题写清核心疑问,避免「求助」「请问」等空泛用语
  • 正文补充环境、版本、报错信息或截图
  • 先搜索本站是否已有相近问题,减少重复提问
  • 若与课程相关,请标明课时或章节便于讲师定位