2026年FPGA校招,手撕Verilog实现AXI4-Stream实时视频缩放,面试官问行缓冲深度怎么算?求具体推导和边界处理

开放11 回答 78 浏览

2026年FPGA校招,面试官让我手撕一个AXI4-Stream的实时视频缩放模块,双线性插值算法。我卡在行缓冲深度的计算上,比如输入是1920×1080,输出是1280×720,缩放系数是2/3,那行缓冲到底需要存几行?面试官还追问了边界像素怎么处理,比如插值系数超出范围时怎么padding?求大佬给个具体推导和Verilog实现思路,最好能附上流水线设计,这样我下次面试能直接答出来。

分享:

11 个回答

  • FPGA萌新

    行缓冲深度跟你缩放系数里的分母直接挂钩。双线性插值需要取周围四个点,垂直方向就要两行数据同时有效。但你说缩放系数2/3,意味着输出一行的Y坐标映射回去可能落在输入的第N行和第N+1行之间——这个映射步长不是整数,所以缓冲深度不能只看2。常见做法是缓冲ceil(1/缩放系数)+1行,1/(2/3)=1.5,ceil是2,再加1就是3行。面试官想听的其实就是这个推导:深度=ceil(1/缩放系数)+1。边界padding的话,简单点就复制边缘像素,不用补零,不然插值结果会偏暗。你下次可以主动说用shift register搭三行缓冲,这样显得你对流水线有数。你现在用的是Xilinx还是Intel的片子?不同厂家的BRAM对齐方式会差一点。

  • Verilog练习生

    面试官问行缓冲深度,核心是想看你有没有理解双线性插值的垂直数据依赖。双线性插值在垂直方向需要两行原始数据同时参与计算,但实时视频缩放里输入行和输出行不是一一对应的——输出第k行的Y坐标映射回输入图像后,通常落在某两行之间。缩放系数2/3意味着输入三个像素出两个像素,映射步长是1.5行。那么输出第一行对应输入第0行和第1行之间,输出第二行对应输入第1.5行和第2.5行之间——你看,输入第1行被反复用到,第2行也跨了两个输出行。所以缓冲深度不是简单等于2,而是至少存够能让插值系数连续计算的行数。推导公式:缓冲深度 = ceil(1 / 缩放系数) + 1。这里1/0.6667≈1.5,ceil得2,加1得3行。为什么加1?因为当映射点落在两行边界时,需要额外一行来保证插值窗口不越界。具体实现时,用三个行缓冲构成一个滑动窗口,每个时钟进来一个新像素,三行数据同步移位。注意行缓冲要存完整一行,1920像素,用BRAM或者分布式RAM看资源。边界处理上,面试官会追问坐标超出[0,1919]或[0,1079]的情况。双线性插值的系数计算要约束在[0,1]区间,如果源坐标小于0就钳位到0,大于最大索引就钳位到最大索引,同时对应的权重强制设为1或0。常见误区是补零,那样边缘会变黑;正确做法是复制边缘像素值,即用最边缘的像素替代越界的邻居。流水线设计上,分成三级:第一级计算源坐标并做边界钳位,第二级从行缓冲读出四个像素,第三级做乘加运算。这样组合逻辑不会太长,时序容易收敛。面试时你还可以提一句,如果缩放系数大于1(放大),缓冲深度公式不变,但映射步长小于1,这时候行缓冲可能只需要两行,因为相邻输出行映射到同一输入行的概率增加。但你这个2/3是缩小,三行是稳妥的。你目前对AXI4-Stream的tlast和tready握手时序熟悉吗?这个缩放模块如果不做帧缓存,握手反压处理不好会丢行。

  • 芯片设计新人

    行缓冲深度这题其实有个工程陷阱:面试官可能故意不说输入输出是否同步时钟域。如果AXI4-Stream的时钟是同一个,那三行缓冲按上面公式算没问题。但如果输入和输出时钟不同,比如输入148.5MHz、输出75MHz(720p常见),那行缓冲还得考虑跨时钟域同步,深度要翻倍或者用异步FIFO。我见过有人面试直接答3行,结果被追问时钟域就愣了。边界处理上,除了复制边缘像素,还有一种做法是镜像padding,就是越界时取对称位置的像素值,这样边缘过渡更平滑,但Verilog实现起来要多写几个条件判断。面试时你可以把两种方案都提一下,说根据PSNR要求选,显得你有工程权衡意识。另外,双线性插值的系数计算用定点数,比如把1.5行的小数部分转成8位定点,乘加结果再截位。注意截位时要加dithering或者四舍五入,不然图像会有条带。你手撕代码的时候,建议先画一个时序图,标清楚每行数据从输入到输出经过几个周期,这样面试官会觉得你思路清晰。你这次面试是线上手撕还是现场白板?线上IDE的话可以提前准备一个行缓冲的模板,现场写能省时间。

  • FPGA学号4

    行缓冲深度其实可以直接从缩放系数推导:双线性插值垂直方向需要两行数据同时有效,但缩放系数2/3映射步长1.5行,所以缓冲深度通常取 ceil(1/系数) +1 = 3行。边界处理用复制边缘像素最省资源,面试官主要是看你有没有真动手写过代码,不是背公式。

  • 电路板玩家

    面试官问行缓冲深度,更想听你把推导过程讲清楚,而不是直接报数字。双线性插值需要同时取上下两行的像素做加权平均,但实时缩放时输入和输出行不是一一对应的——输出第k行的Y坐标映射回去可能落在输入的第N行和第N+1行之间,而且缩放系数2/3意味着每输出一行,映射点前进1.5行,所以同一行输入像素可能被多个输出行引用。常见的做法是缓冲 ceil(1/缩放系数) +1 行,这里1/(2/3)=1.5,ceil得2,加1后就是3行。加的这个1是为了应对映射点正好落在两行边界时,插值窗口需要多一行做安全垫。边界处理上,除了复制边缘像素,还有一种做法是镜像对称,就是越界时取对称位置的像素值,这样边缘过渡更平滑,但Verilog实现要加额外条件判断。面试时你可以主动提这两种方案的取舍,比如资源多就想画质好一点用镜像,资源紧就复制边缘。流水线设计上,建议把行缓冲用shift register搭成三级流水,每拍更新一行数据,配合双线性插值的系数计算用定点数截位,截位时加dithering能减少图像条纹。你现在是用BRAM还是分布式RAM做行缓冲?这个会影响深度和时序。

  • EE学生一枚

    我当年面试也踩过这个坑,面试官追问时钟域才反应过来。你这里AXI4-Stream的输入输出时钟是不是同一个?如果是异步时钟域,行缓冲得考虑跨时钟域同步,深度可能要翻倍或者用异步FIFO,不能简单按公式3行算。边界padding的话,补零在图像边缘会引入黑边,复制边缘像素是工程里最常见的做法,Verilog实现就是判断当前坐标是否越界,越界时用最边上的像素值替代。你可以准备一个状态机控制流水线,把读行缓冲、计算插值系数、输出像素分三个周期处理,这样面试官会觉得你有设计规范的概念。你现在在练哪家开发板的例程?不同厂家的BRAM配置习惯差别挺大的,提前说清楚能加分。

  • 硅基探索者

    面试官问行缓冲深度,其实不是考你背公式,而是看你有没有真的画过时序图。你拿张草稿纸,把输入视频的像素时钟画一排小格子,每个格子代表一个有效像素,假设输入1920×1080@60Hz,像素时钟大概148.5MHz。然后输出1280×720,缩放系数2/3,意味着每来3个输入像素,你要产生2个输出像素——但这是水平方向。垂直方向呢?输出第0行映射回输入,坐标可能在0.67行,也就是输入第0行和1行之间;输出第1行映射到1.33行,在输入第1和2行之间。看到没?输入第1行被两个输出行用到了,这就是为什么缓冲深度不能只是2行。推导过程:你需要的行数 = ceil(1 / 垂直缩放系数) + 1。垂直缩放系数和水平一样是2/3,1除以它得1.5,向上取整得2,再加1就是3行。加的这个1是为了应对映射点正好在整数行边界时,插值窗口还能正常取到下面一行。边界处理上,我个人建议面试时别只说复制边缘像素,你可以补一句:「如果项目对边缘画质有要求,可以用镜像对称padding,代价是多几个判断逻辑,但PSNR能高0.3-0.5dB。」这样显得你真的做过图像质量调优。流水线设计的话,三级流水就够了:第一级读行缓冲并更新写指针,第二级根据当前输出坐标算出映射后的垂直小数部分,第三级做乘加。注意第三级的乘加要用DSP48,别用LUT拼,面试官看到你用对了硬核资源会加分。你现在有在练Xilinx的Vivado还是Intel的Quartus?两个工具的行缓冲原语名字不一样,提前说清楚能省很多解释时间。

  • 芯片新人

    缓冲深度就是ceil(1/缩放系数)+1,这里1/0.6667=1.5,ceil=2,+1=3。边界用复制边缘像素,Verilog里一个三目运算符搞定。面试官其实就想听你快速说出这个推导,别绕弯子。

  • 芯片测试初学者

    关于行缓冲深度,我换个角度说:你把它当成一个滑动窗口看,窗口高度是插值需要的行数,双线性插值垂直方向要2行,但缩放系数2/3导致窗口移动步长不是整数,所以窗口实际覆盖的行数可能比2多。具体推导:输出每前进一行,映射点前进1/缩放系数=1.5行,所以窗口在一帧时间内最多覆盖ceil(1.5)+1=3行。边界处理上,补零是新手常见错误,因为零会让边缘像素变黑,画面会有明显黑框。复制边缘像素是最稳妥的,你可以在行缓冲的读写逻辑里加一个边界判断:如果当前行号小于0,就用第0行的数据,如果大于最大行号,就用最后一行的数据。Verilog实现时可以用一个计数器记录当前输入了多少行,配合输出行号做比较。另外注意AXI4-Stream的TLAST信号,每行结束时拉高,行缓冲的写使能要根据TVALID和TREADY握手信号来控,别漏了TREADY反压的情况,否则缓冲会写错地址。

  • FPGA菜鸟

    面试官问行缓冲深度,其实是想看你有没有真正理解双线性插值在实时视频里的数据依赖。你画个图就清楚了:输入1080行,输出720行,垂直缩放系数2/3,意味着输出每走一行,映射点往回跳1.5行。输出第0行的Y坐标映射到输入第0行和第1行之间,输出第1行映射到第1行和第2行之间——你看,输入第1行被两个输出行同时用到,所以缓冲不能只存两行。推导公式是ceil(1/缩放系数) + 1,这里1除以2/3得1.5,ceil得2,加1就是3行。加的这个1是安全垫,防止映射点正好落在整数行边界时插值窗口越界。边界处理我建议用复制边缘像素,Verilog里写一个三目运算符判断当前行号是否小于0或大于等于1080,越界就用最边上的行数据。补零会让边缘出现黑边,面试官一眼就能看出你没实际调过图像。另外提一句,你写的行缓冲读写逻辑一定要配合AXI4-Stream的TVALID/TREADY握手,不然数据流会断。你现在有在FPGA板子上跑过视频通路吗?不同开发板的BRAM配置习惯差异挺大的。

登录后可在本页底部提交回答

提问者

数字系统入门查看主页
浏览「就业招聘」

描述场景与已尝试方案,更容易获得有效解答

相关问题

同分类

提问建议

  • 标题写清核心疑问,避免「求助」「请问」等空泛用语
  • 正文补充环境、版本、报错信息或截图
  • 先搜索本站是否已有相近问题,减少重复提问
  • 若与课程相关,请标明课时或章节便于讲师定位