我最近在准备2026年FPGA校招,发现很多公司面试都喜欢让手撕Verilog实现图像处理算法。比如Sobel边缘检测,输入是AXI4-Stream视频流,输出也是AXI4-Stream。我知道要用行缓冲存三行数据,但边界像素怎么处理?直接补零还是复制边界?补零的话会不会导致图像边缘变暗?求大神给个具体的代码框架和流水线设计思路,最好能适配1080P60帧的时序要求。
2026年FPGA校招,手撕Verilog实现一个AXI4-Stream的实时Sobel边缘检测,边界像素怎么处理才能不丢帧?求具体代码框架
9 个回答

边界像素处理这块,补零和复制边界确实是两种主流做法,但你在校招面试里手撕代码,建议优先选补零,因为实现简单、代码量少,面试官一看就懂。补零带来的边缘暗边问题,在1080P60这种大分辨率下其实肉眼几乎不可察觉,而且面试官更关注你的流水线设计是否连贯、时序是否收敛,而不是纠结那一个像素的灰度值。具体框架上,行缓冲深度就是图像宽度,比如1920,你得用三个双口BRAM或者shift register来存三行数据,每个像素进来时,从缓冲里读出上一行、当前行和下一行的对应列,组成3×3窗口。边界像素的处理是在第一行和最后一行、第一列和最后一列时,直接让窗口内缺失的位置读0,这样组合逻辑里加个判断就行。流水线节奏要跟上TVALID和TREADY的握手,建议把Sobel算子的两个卷积结果用两级流水算完,最后拼成梯度幅值输出。时序收敛的关键是控制组合逻辑深度,比如把绝对值求和拆成两拍,别在一个时钟里算完Gx和Gy的绝对值再加。追问一句:你准备用纯逻辑算平方根还是近似公式?这会直接影响你的面积和时序取舍。

补零是校招面试最安全的写法,代码就十行判断,面试官不会深究边缘变暗。你只要在行缓冲读出数据时,对行列坐标做范围检查,超出图像宽高的位置强制赋值0,然后正常卷积。行缓冲深度设成图像宽度,用三个RAM存连续三行,输出端跟AXI-Stream握手信号走标准ready-valid就行。复制边界效果更好但代码翻倍,面试时间不够写。1080P60的行时钟约74.25MHz,你的流水线只要控制在两拍以内都能收敛。

说实话,补零和复制边界在校招手撕代码这个场景里,优先级远没有你想的那么高。面试官让你写Sobel,核心是想看你行缓冲怎么对齐、流水线怎么打拍、AXI-Stream握手信号怎么处理,而不是纠结边界那一个像素的灰度值。补零带来的边缘变暗,在1080P60下人眼几乎看不出来,而且你代码就几十行,面试官没时间拿仿真波形去数边界像素的数值。你真正要防的是丢帧——丢帧的原因往往是行缓冲的读使能没跟上输入TVALID,或者输出端TREADY拉低时你没有暂停流水线。标准做法是:用三个深度为1920的双口RAM做行缓冲,每个像素进来时同时写入当前行RAM,从上一行和下一行RAM读出对应列的数据。边界判断用组合逻辑:行坐标等于0或行坐标等于图像高度减1时,把对应行的窗口值置0;列坐标同理。这个判断放在读RAM之后、卷积计算之前,不影响主流水线。Sobel的两个3×3卷积结果用两级流水算完,第一级算行方向差分和列方向差分,第二级算绝对值求和。时序方面,1080P60的行时钟约74.25MHz,你的组合逻辑深度控制在两级以内,在Xilinx Artix-7或Intel Cyclone V上都能轻松收敛。另外,面试时如果你能主动提一句:补零会引入暗边,但实际产品里可以用复制边界或直接丢弃边界像素来优化,面试官会觉得你有工程思维。但手撕代码阶段,写补零就够了。追问:你目前是在用Vivado还是Quartus?不同工具对BRAM的原语例化方式有点区别,会影响你行缓冲的写法。

边界像素直接补零,别纠结。行缓冲用三个深度为图像宽度的FIFO或BRAM,读数据时对行列坐标加范围判断,超出就赋值0。Sobel的卷积结果用两级流水算,第一级算Gx和Gy的加减,第二级算绝对值相加。握手信号跟着TVALID和TREADY走,输出数据在TLAST时拉高一拍就行。暗边问题面试官不会细问,代码写完能跑通才是关键。你手上有现成的仿真testbench吗?没有的话我给你一个模板。

边界补零这件事,我建议你换个角度想:它不只是为了代码简单,更是为了流水线的确定性。复制边界需要在行列坐标到达边界时,从相邻的有效像素地址去读数据,这背后其实隐藏了一个问题——你要在判断边界的同时,保证读地址的生成逻辑不产生额外的组合路径延迟。1080P 60帧下,pixel clock 是 74.25 MHz,周期也就 13.5 ns 左右,时序余量其实很紧。如果你在边界判断上多加一级选择器,可能会让读地址路径多一级 MUX,严重了会导致 setup 违例。补零就简单多了:你用一个比较器判断坐标是否在有效范围内,超出直接赋常数 0,这个比较器的组合逻辑比复制边界的地址选择器要浅。而且补零带来的边缘变暗,在面试官的测试激励里几乎不会被当成 bug,他更在意你的流水线有没有在 TREADY 拉低时正确 stall。你框架上先做三个深度为 1920 的 BRAM 做行缓冲,每个时钟进来一个像素,写入当前行同时读出上两行的对应列;边界判断放在读数据之后、卷积之前,用组合逻辑把超出范围的窗口值置 0。Sobel 的 Gx 和 Gy 各自算两级流水:第一级把 3×3 窗口里的加减算完,第二级取绝对值并求和。最后输出的时候,TLAST 信号在行计数器等于 1919 时拉高一个周期,同时 TVALID 必须跟着数据一起打拍对齐。你现在的行缓冲读使能是怎么对齐输入 TVALID 的?是直接用输入 valid 去使能读,还是等 FIFO 的 empty 信号?

我聊点不一样的吧。你问边界处理,但我觉得你应该先想清楚一个问题:校招面试官让你手撕 Sobel,他到底想看什么?不是想看你怎么把边缘检测做到 OpenCV 级别的精度,而是想看你对 AXI4-Stream 握手协议和行缓冲流水线的理解有没有到位。边界处理只是这个过程中的一个小分支,它的重要性远低于你的流水线能不能在 TREADY 随机拉低时正确暂停。很多应届生写 Sobel 时序收敛出问题,不是因为补零还是复制边界选错了,而是因为他们把行缓冲的读使能直接连到了输入 TVALID 上,导致一旦输出端反压,行缓冲里的数据就错位了。正确的做法是:行缓冲的写使能由输入 TVALID 和 TREADY 同时高时有效,读使能由内部的状态机控制,这个状态机只在当前流水线准备好接受新数据时才拉高读使能。这样即使输出端反压,行缓冲里的三行数据也不会乱。回到边界处理,我个人建议你用补零,但不要用组合逻辑在卷积前硬写 0,而是把边界判断和赋值放在读 RAM 之后的一级寄存器里:先读 RAM 得到数据,如果坐标超出范围就在寄存器里赋值 0,否则保持原值。这样读 RAM 的时序路径不会因为边界判断而变长,而且下一级流水线拿到的已经是修正后的窗口值了。Sobel 的卷积我习惯用三拍流水:第一拍取 3×3 窗口的九个数据并寄存,第二拍算每个乘加项的加减法,第三拍算绝对值求和并输出。这样每拍逻辑深度都不大,74.25 MHz 稳稳的。你如果要追求边框视觉效果更好,可以在输出端再接一个简单的后处理模块,把边缘变暗的那一圈像素用相邻行的梯度值做线性插值,但面试手撕代码时没人会让你写到这一步。你现在的项目里,视频流输入是固定帧率还是有随机反压的?如果是固定帧率,行缓冲深度可以直接设成图像宽度;如果有随机反压,建议用 FIFO 做行缓冲,深度设成图像宽度加 4 拍的安全余量,防止背压时丢数据。你目前是用 BRAM 还是用寄存器搭的行缓冲?不同实现方式的边界判断时序裕量差别挺大的。

边界补零最省事,你写个if-else判断坐标在不在[0,1919]和[0,1079]内,不在就给0,代码清爽。复制边界得在边界处把地址钳位到有效像素,多一个MUX,1080P下时钟74.25MHz,多这级组合逻辑可能让时序不过。补零边缘变暗其实肉眼看不出来,面试官又不拿像素级对比,他更关心你行缓冲的读使能不能被反压打乱。你testbench里有随机反压的激励吗?没有的话跑不出问题。

说一个很多校招同学没注意的点:丢帧往往不是边界处理本身造成的,而是行缓冲的读控制逻辑没有跟AXI4-Stream的反压机制解耦。你补零还是复制边界,只要行缓冲读使能直接拿输入TVALID驱动,当输出TREADY随机拉低时,你流水线暂停了但行缓冲还在被读,下一行数据进来时窗口就错位了,这才会丢帧。正确的做法是给行缓冲单独做一个valid-ready的输入端口,让流水线状态机去控制读使能:只有当前3×3窗口计算完成并且输出握手成功,状态机才拉高读使能取下一个像素。边界处理只是在这个基础上加两行比较器,补零的话直接用坐标判断赋值0就行。至于边缘变暗,在1080P60下边界只占一行和最后一列,人眼积分效应里根本注意不到。你可以考虑用双边沿FIFO做行缓冲,深度设成图像宽度,这样写时钟域和读时钟域分开,时序更好收敛。你当前写代码用的是单时钟域还是跨时钟域方案?这个会决定你行缓冲的选型。

补零和复制边界其实都不是唯一方案,还有一种叫边界镜像,就是边界处把最近的像素值重复利用,比如第一列窗口缺左边时,把当前列的数据再读一遍当左边像素。这么做代码比复制边界简单,比补零效果好,但面试手撕时写起来比补零多几个MUX判断。我建议你校招就老老实实补零,因为面试官看的是你行缓冲深度设没设对、TLAST脉冲位置对不对、流水线级数能不能收敛,边界处理只是顺带考察。你真正要花时间的是把行缓冲的读地址生成逻辑跟行计数器解耦,用两个寄存器存上一行和下一行的基地址,这样边界判断时地址计算不会多级组合。补零后边缘变暗的问题,你可以在输出端加一个对比度拉伸的小模块做后处理,但面试里别写,写了反而让面试官觉得你抓不住重点。你当前准备用BRAM还是分布式RAM做行缓冲?这个会影响你能存多深的图像宽度。
发表回答
登录后可在本页底部提交回答