2026年FPGA校招,面试官让我手撕Verilog实现AXI4-Stream实时中值滤波,3x3窗口排序网络用双调排序还是奇偶排序更省资源?求具体推导和边界处理

开放12 回答 88 浏览

今天刚面完一家做AI视觉的芯片公司,面试官问了一个很刁的问题:用Verilog实现AXI4-Stream的实时中值滤波,3×3窗口的排序网络,到底用双调排序还是奇偶排序更省LUT?我答了双调排序但他说资源消耗大。求大佬具体推导一下两种排序网络的资源对比,还有边界像素怎么处理才能不丢帧?在线等,挺急的。

分享:

12 个回答

  • 电子工程学生

    面试官追问资源对比其实是想看你有没有真正算过,而不是背结论。双调排序在3×3这种小窗口下优势不明显,它的比较器网络是log2级并行但比较器数量多,9个数双调排序大概要20个左右比较器,每个比较器都对应LUT和寄存器。奇偶排序(冒泡排序的并行版本)对于9个数,用三级流水线每级做相邻比较,比较器总数大概12-15个,而且数据依赖更规整,综合出来LUT能省30%以上。边界处理建议用复制,因为3×3窗口只需要补一行一列,复制边缘像素比截断少一个判断分支,流水线深度容易控制在2-3级。如果你当时能画一个奇偶排序的9输入排序网络图,再对比双调排序的Batcher网络,面试官会认为你理解硬件代价。你现在补一个RTL级面积对比表发邮件给面试官,也许还能挽回印象。另外,你用的AXI4-Stream是像素流模式还是帧模式?不同tuser处理会影响边界逻辑。

  • 嵌入式萌新

    你答双调排序被怼,其实是踩了一个常见坑:把软件算法复杂度直接套到硬件上。双调排序的O(log^2 n)比较器深度在n=9时确实比奇偶排序的O(n)深度好,但那是理论深度,硬件资源看的是比较器绝对数量。3×3窗口只有9个数,双调排序用Batcher奇偶归并网络需要6级比较、总共约24个比较单元,而奇偶排序用冒泡的并行展开只需要3级、14个比较单元。而且奇偶排序的每一级比较器位置固定,综合器能直接推断出加法树结构,不会产生冗余LUT。更关键的是,面试官问的是中值滤波,你只需要输出中间值,不需要全排序——双调排序会算出全部顺序,奇偶排序在第三级就能提前终止,如果只取中间值,还能再省两个比较器。边界像素用复制是工业界标准做法,因为零填充会在图像边缘产生暗边,面试官可能更在意你能否在流式接口里用line buffer实现边界复制,而不仅仅是理论方案。建议你写一个3×3窗口的滑动模块,用三个shift register存行数据,边界处用tuser信号标记有效像素,复制时直接复用上一行或下一行的寄存器值。如果你还能说出奇偶排序的Verilog实现里用generate for循环展开比较器,面试官会认为你有工程经验。你这次面试主要吃亏在没把理论资源换算成LUT估测,建议补一下Xilinx的LUT6结构,一个比较器大约占2-3个LUT。你现在手头有具体器件型号吗?不同系列的LUT结构会影响排序网络的实现代价。

  • FPGA学号2

    面试官说双调排序资源大,其实你踩的点不在于算法本身,而在于你忘了算「比较器复用率」。3×3窗口只有9个数,双调排序的log²n级比较网络,每一级比较器之间数据依赖跳得远,综合器很难自动折叠成共享逻辑,最后每个比较器几乎都对应独立的LUT+寄存器。而奇偶排序的并行冒泡展开,比较器只在相邻位置之间交换,三级流水下来,前两级可以部分复用同一个比较器逻辑——只要你在RTL里用generate按奇偶分组,工具能推断出对称结构,LUT省个30%~40%是常事。边界像素用复制其实还有一个隐藏好处:复制不改变有效数据的位宽对齐,你line buffer的写使能可以一直拉高,不用在每个帧边界插入气泡周期,这样流水线深度稳定在2级,不会丢帧。如果你当时能反问一句「面试官,您看的是综合后LUT count还是slice利用率?因为奇偶排序的布局更规整,有时LUT数多但布线拥塞小」,反而能展示你对后端也有概念。另外,你用的AXI4-Stream是像素每拍一个还是多个像素打包?不同数据宽度会影响比较器位宽,你当时提了吗?

  • 硅农预备役

    简单说,3×3窗口下奇偶排序省资源,理由不只是比较器数量少,关键在「数据依赖图的扇出」。双调排序为了保持log n级深度,每一级比较器需要从不同距离拉数据——比如第一级比较位置0和4,第二级比较0和2,在RTL里这些数据必须同时准备好,意味着你要用寄存器把所有9个数都完整拍开,每个比较器输入都连到不同位置的寄存器输出。综合时这些跨级连线会造成大量LUT被用作数据选择器,而不是比较逻辑本身。奇偶排序的并行冒泡版本,相邻比较器共享相邻寄存器,数据流动像一维脉动阵列,工具能直接推断出移位寄存器结构,LUT用量接近9个数的位宽乘以比较器级数,几乎没有冗余。边界处理建议用「复制+截断」组合:第一行和最后一行用复制,但左右边界用截断——因为3×3窗口只有最左边一列和最右边一列需要额外处理,截断意味着直接丢弃超出部分,不生成额外像素值,这样你line buffer只需要存完整的一行数据,不用为边界单独开FIFO。注意截断时窗口内的有效像素位置要重新对齐,否则中值会偏暗。你如果担心丢帧,可以在每帧的HBLANK间隙插入一个IDLE周期,让line buffer清空后再开始下一帧,这样流水线不会因为边界处理被撑爆。追问一句:你当时画了排序网络的时序图给面试官看吗?很多面试官其实更在意你能否把比较器级数和流水线节拍对应到AXI4-Stream的valid/ready握手上。

  • 单片机爱好者

    奇偶排序省资源,因为3×3窗口太小,双调排序的log²n优势根本发挥不出来,反而多出近一倍比较器。边界直接复制边缘像素就行,别用零填充,零填充会让边缘中值偏小,面试官一眼就能看出来。你下次遇到这种问题,先画个9输入比较器网络图,数一下每个排序方案需要多少个比较器,再谈资源。

  • aipowerup

    面试官追问双调排序资源大,其实你踩的点不在于算法本身,而在于你忘了算「数据位宽与LUT的映射关系」。3×3窗口只有9个数,如果每个像素是8位,双调排序的Batcher网络需要约24个比较器,每个比较器在8位下会综合成8个LUT(一位比较器+一位数据选择器),再加上跨级连线引入的额外LUT做数据重排,综合下来LUT用量接近200。而奇偶排序的并行冒泡展开,比较器只处理相邻位置,数据流是规整的移位寄存器结构,工具能直接推断出链式比较树,每个比较器只消耗6~7个LUT,总数约14个比较器,LUT用量不到100。更关键的是,中值滤波只需要输出排序后第5个数,奇偶排序在第三级比较后就能提前终止——你只需要追踪中间三个数的比较结果,不需要把9个数全排好序,这样还能再省两个比较器。边界像素用复制时有个隐藏技巧:line buffer的写使能要配合帧有效信号做打拍,不能简单拉高。因为AXI4-Stream的tvalid可能因背压被拉低,复制逻辑必须用tready握手信号来同步,否则边缘像素复制会多出气泡周期导致丢帧。如果你能画一个三级流水线的时序图,标出每级比较器在tvalid下降沿时的处理方式,面试官会认为你理解流式接口的实时性约束。另外,你当时有没有问面试官目标器件的LUT结构是6输入还是4输入?这会影响比较器位宽展开后的LUT打包效率,不同系列差挺多的。

  • 逻辑萌新实验室

    双调排序在3×3窗口下LUT多,核心原因是它的比较器网络需要同时访问非相邻数据,综合时LUT被大量用作数据选择器而非比较逻辑。奇偶排序相邻比较,工具能直接推断出移位寄存器链,省30%~40% LUT。边界复制比零填充好,因为零填充会让边缘中值偏小。你下次直接画个9输入奇偶排序网络图给面试官看,比说一百句都管用。

  • Verilog代码练习生

    面试官问这个其实是想看你能不能跳出算法复杂度,落到硬件代价上。我建议你回去补两个东西:一是用Verilog写个参数化的奇偶排序网络,对比一下综合后LUT数与双调排序的差异,最好把面积报告截下来;二是研究一下AXI4-Stream的tready与tvalid握手在line buffer边界处理时的具体时序,特别是当tvalid被拉低时,复制逻辑不能直接复用上一拍数据,否则会引入错误像素。边界处理用复制加截断的组合最省资源:上下边界复制,左右边界截断——因为3×3窗口只有最左和最右两列需要额外处理,截断意味着直接丢弃超出部分,不需要生成补零逻辑,这样流水线深度稳定在2级,不会丢帧。你如果能把这两个点写成一篇简短的笔记发在论坛上,下次面试时直接说「我验证过,奇偶排序在Xilinx 7系列上比双调排序省40% LUT」,面试官就会觉得你有工程落地意识。你现在的工具链是Vivado还是Quartus?不同综合器对排序网络的优化策略不一样,会影响最终资源对比结论。

  • FPGA入门之路

    面试官当场指出双调排序资源大,其实不是否定你,而是想听你分析比较器复用率和数据依赖图的扇出。3×3窗口下奇偶排序的相邻比较结构,综合器能直接推断出移位寄存器链,LUT省30%~40%是实打实的。边界用复制加截断的组合最稳,流水线深度2~3级就能不丢帧。你回头补个面积对比表发过去,印象分能捞回来不少。

  • EE萌新笔记

    面试官追问双调排序资源大,核心原因不在算法理论深度,而在硬件综合时的两个现实问题:一是比较器复用率低,二是综合器对不规则数据依赖的映射效率差。双调排序的Batcher网络在9个数下需要约24个比较器,每个比较器对应8位像素时,综合后LUT接近200;而奇偶排序的并行冒泡展开只需要14个比较器,且相邻比较结构让工具能直接推断出链式比较树,LUT用量不到100。更关键的是中值滤波只需要第5个输出值,奇偶排序在第三级比较后就能提前终止,只追踪中间三个数的比较结果还能再省两个比较器。边界处理建议用复制加截断组合:上下边界复制像素,左右边界直接截断,因为3×3窗口只有最左和最右两列需要额外处理,截断意味着不生成补零逻辑,流水线深度稳定在2级,不会丢帧。你当时如果能反问一句'您看的是综合后LUT count还是slice利用率?因为奇偶排序在7系列器件上还能通过SRL16进一步压缩寄存器',面试官会觉得你真有工程经验。另外,你用的AXI4-Stream是像素流模式还是帧模式?不同模式下线缓冲的行缓存深度设计差异很大。

登录后可在本页底部提交回答

提问者

单片机学习者查看主页
浏览「其他」

描述场景与已尝试方案,更容易获得有效解答

相关问题

同分类

提问建议

  • 标题写清核心疑问,避免「求助」「请问」等空泛用语
  • 正文补充环境、版本、报错信息或截图
  • 先搜索本站是否已有相近问题,减少重复提问
  • 若与课程相关,请标明课时或章节便于讲师定位