2026年双非本科FPGA秋招,简历上写了个RISC-V软核SOC项目,面试官会深挖哪些细节才能拿到30W+?

开放12 回答 83 浏览

我是双非电子专业,今年秋招投FPGA岗位,简历上写了一个基于国产安路FPGA的RISC-V软核SOC项目,包括AHB总线、UART和GPIO外设。但担心面试官觉得太浅,想问下一般会追问哪些细节?比如流水线结构、中断控制器设计、总线仲裁这些会不会问?怎么准备才能拿到30W+的offer?

分享:

12 个回答

  • FPGA新手村村民

    面试官大概率会揪着AHB总线仲裁和中断控制器问,因为这是SOC里最容易暴露水平的模块。你如果能讲清楚仲裁优先级怎么设、中断向量表怎么映射到总线地址,基本就过了。30W+的关键不是RISC-V核本身,而是你对外设和总线的理解有多深,别在流水线细节上花太多时间,双非背景更看重工程落地能力。

  • 电子爱好者小张

    其实30W+的FPGA岗位对应届生来说,重点不是你RISC-V核写了多少行代码,而是你能不能讲清楚这个SOC在安路FPGA上跑起来遇到了什么实际坑。比如时钟域怎么处理、GPIO中断响应延迟大概多少周期、UART波特率误差怎么算。面试官见过太多只会背教材的,你如果能把AHB总线仲裁的握手过程用波形画出来,再顺带提一句多主设备时的优先级反转问题,那印象分就上去了。建议你找块开发板实测一下中断响应时间,面试时直接报数据,比空谈流水线结构有用得多。

  • 嵌入式小白菜

    面试官问RISC-V软核SOC项目时,最常挖的三个点其实是:总线仲裁、中断控制器、存储映射。先说AHB总线,双非背景的同学最容易栽在『多主设备同时请求时怎么仲裁』,你得能讲清楚固定优先级和轮询仲裁的区别,最好能画个状态机。中断控制器方面,别只写『支持外部中断』,要能说出中断向量地址怎么生成、嵌套中断怎么处理——哪怕你的设计里没做嵌套,也要知道如果要扩展该加什么逻辑。至于30W+的offer,坦白说纯靠这个项目有点悬,因为双非学历下HR会拿薪资包压你,建议你补一个高速接口项目比如DDR3控制器或者MIPI接收,哪怕只是仿真,也能证明你有处理时序收敛的能力。另外,面试时如果被问到『你的RISC-V核支持哪些指令?』,别只答RV32I,最好能说出你删减了哪些指令、为什么删,这比背流水线级数更能体现工程思维。最后提醒一点,安路FPGA的工具链和Xilinx差别挺大,面试官可能会问你怎么约束时序、怎么用IP核,提前把工程里遇到的时序违例案例准备好。你目前这个项目做完了吗?还是还在调通阶段?这个信息会影响我建议你重点补哪块。

  • 技术新芽

    面试官大概率会先让你画出AHB总线的单次传输时序图,然后问你如果master和slave的ready信号不同步会怎样。你只要能说出hready拉低时插入等待周期、并且知道burst传输中hresp返回ERROR时怎么处理,基本就过关了。另一个高频点是中断:你的GPIO中断是电平触发还是边沿触发?如果两个中断同时到达,怎么决定响应顺序?能答到这个层次,30W+有希望。

  • 逻辑设计初学者

    说实话,双非本科想靠一个RISC-V软核SOC项目拿到30W+,你需要想清楚一件事:面试官不是要你造一个完整的CPU,而是要验证你有没有能力把别人的IP集成好、跑通、并解决实际工程问题。我当年面试过一个学生,他简历上写的RISC-V项目,我问他UART的波特率发生器怎么配置的,他答了分频公式;我接着问如果时钟是50MHz,要产生115200波特率,分频系数算出来有小数怎么办,他愣了几秒说会取整。其实取整没问题,但你要自己算一下误差率,如果超过3%就该换一个波特率或者改用小数分频器。这就是工程思维——面试官要听的不是你背了AHB总线的五种传输类型,而是你上板实测时发现串口乱码怎么排查。建议你拿逻辑分析仪抓一下UART的Tx波形,把起始位、数据位、停止位的实际时间量出来,面试时直接报你的实测误差率,比说一百句『我熟悉UART协议』都管用。另外,关于30W+这个薪资预期,坦白讲在双非本科里属于头部待遇,你得同时具备两个条件:一是简历上有至少两个能落地的项目(另一个建议做个高速接口,比如用安福FPGA的硬核DDR3控制器读写测试),二是笔试和手撕代码能过。纯靠一个SOC项目,即使讲得再深,HR也会拿学历压价。所以优先把UART和GPIO的实测数据整理好,再补一个时序收敛的案例,比如你怎么把RISC-V的Fmax从50MHz优化到80MHz的,这才是拉开差距的关键。你目前有在开发板上测过中断响应延迟吗?

  • 数字IC萌新

    另一个容易被忽略的细节是存储映射的地址分配。很多同学写SOC项目时,外设地址随便给个0x0000_1000就完了,但面试官会问:如果你的GPIO和UART的地址空间有重叠,或者总线访问时地址没对齐,会发生什么?你要能说出AHB协议里HSIZE信号决定传输大小,地址必须按HSIZE对齐,否则slave会返回ERROR。实际项目里安路的FPGA工具会把未用到的地址空间映射到默认slave,如果默认slave没配置好,访问空地址会导致总线挂死。你可以在简历里加一句『设计了地址译码逻辑,支持4KB粒度外设映射,并通过AHB默认slave防止非法访问』,面试时顺着这个点展开,比只写『熟悉AMBA协议』更显功力。顺便问一句,你的RISC-V核跑在多少MHz?安路FPGA的时序约束你是怎么设的?

  • 电子爱好者小张

    其实面试官最可能先问的不是流水线级数,而是你这套东西怎么在安路FPGA上跑起来的。双非同学简历上有RISC-V项目已经比很多人强了,但想拿30W+,你得能讲清楚板上调试时遇到的真实波形。比如UART发出去的数据和PC收到的不一致,你是先查波特率误差还是先看电平转换芯片?我建议你找个逻辑分析仪,把AHB总线上master发地址、slave回数据的握手过程抓一段出来,面试时直接拿出波形图说:这里hready拉低了三个周期,因为我的GPIO模块里有个同步器跨时钟域,需要多等两拍。这种细节比背AMBA协议规范有用一百倍。另外提醒一句,安路的工具链和Xilinx不一样,你写时序约束时有没有踩过create_clock设错频率导致布局布线后时序不收敛的坑?能把这个过程讲清楚,面试官会认为你有独立解决工程问题的能力。顺便问一句,你的RISC-V核跑在多少兆赫兹?安路那个器件速度等级够用吗?

  • 硅农预备役2024

    个人感觉30W+的关键不是项目多花哨,而是你能不能一句话说清楚RISC-V核取指令时,如果指令缓存在AHB总线上miss了,整个soc怎么停下来等。面试官要的是你理解总线握手和流水线stall的关系,不是背流水线级数。

  • FPGA学员4

    双非背景冲30W+,光靠RISC-V软核项目其实有点勉强,但也不是没机会。我建议你把重点从CPU核本身挪到SOC集成上,面试官大概率会顺着你的简历问:这个AHB总线是你自己写的还是用的别人的IP?如果你说用的是开源或者安路自带的,那他们就会追问你对总线协议的理解深度——比如slave返回ERROR时你的master怎么处理的,burst传输中途被打断会怎样。另一个必问的点是中断:你的GPIO中断是电平触发还是边沿触发?如果两个外设同时发中断,你的中断控制器是按固定优先级还是轮询?很多人会答固定优先级,但面试官接着就会问:那如果高优先级的中断一直不停,低优先级的外设永远得不到服务怎么办?你能不能加一个屏蔽寄存器或者改成可编程优先级?这种追问才是拉开差距的地方。另外我建议你补一个存储方面的细节:你的RISC-V核取指令和数据是共用一条AHB总线还是分开的?如果是共用,那连续访问指令和数据时会不会产生总线冲突?你可以在设计里加一个简单的仲裁器,面试时就说:我做了固定优先级仲裁,指令访问优先于数据访问,因为取指令阻塞会直接影响流水线效率。这个回答比空谈哈佛结构实用得多。最后说个面试技巧:不要等面试官问完才回答,你可以主动说『我在调试时发现GPIO中断响应延迟大概在15个时钟周期左右,主要瓶颈是总线仲裁和中断向量提取』,这种实测数据很容易让面试官觉得你有工程思维。不过说实话,纯靠这个项目拿30W+压力很大,建议你再做一个高速接口的仿真项目比如DDR3或者以太网,哪怕只是模型级别的验证,也能证明你有处理时序收敛的能力。对了,你的RISC-V核支持哪些指令集扩展?如果只做了RV32I,面试时最好主动说为什么没做M扩展——比如乘法器太吃资源,你的安路FPGA逻辑单元不够,这种取舍比硬着头皮说全做了更显真实。

  • FPGA学员2

    其实面试官最怕的不是你项目简单,而是你答不出自己写的代码为什么那样写。你说你做了AHB总线、UART和GPIO,那面试官大概率会顺着这个问:你这个UART的波特率发生器,时钟50MHz,目标115200,分频系数算出来有小数,你取了整,那误差率是多少?超过3%的话你会怎么处理?很多人只会背分频公式,但没真算过。你如果能直接报出实测误差率,再说可以改用一个更高频的时钟或者加小数分频器,那就不一样了。另一个容易挖的点是中断:你的GPIO中断是电平触发还是边沿触发?如果两个外设同时发中断,你的中断控制器怎么决定先响应谁?很多人说固定优先级,但面试官会追问:那高优先级中断一直来,低优先级永远拿不到CPU怎么办?你能答出加屏蔽寄存器或者做成可编程优先级,就能拉开差距。还有一个细节是地址映射:你的外设地址是怎么分配的?如果总线访问时地址没对齐,按AHB协议里HSIZE的规定,slave应该返回ERROR,你的代码里处理了吗?如果没处理,访问空地址可能导致总线挂死。这些点比流水线级数更实用。建议你拿逻辑分析仪抓一段AHB总线上master发地址、slave回数据的握手波形,面试时直接说:这里hready拉低了三个周期,因为GPIO模块里有跨时钟域同步器,需要多等两拍。这种工程细节比背协议有用得多。另外,你RISC-V核跑在多少MHz?安路FPGA的时序约束你怎么设的?如果create_clock设错频率导致布局布线后时序不收敛,你是怎么排错的?能讲清楚这个,面试官会觉得你有独立解决工程问题的能力。顺便问一句,你的SOC里有没有做多主设备仲裁?如果有,固定优先级和轮询仲裁你选了哪个,为什么?

登录后可在本页底部提交回答

提问者

数字设计新人查看主页
浏览「其他」

描述场景与已尝试方案,更容易获得有效解答

相关问题

同分类

提问建议

  • 标题写清核心疑问,避免「求助」「请问」等空泛用语
  • 正文补充环境、版本、报错信息或截图
  • 先搜索本站是否已有相近问题,减少重复提问
  • 若与课程相关,请标明课时或章节便于讲师定位