面试官让我手写一个灰度转换的Verilog模块,要求支持4K60帧输入,AXI4-Stream接口。我知道灰度公式是0.299R+0.587G+0.114B,但用浮点乘法会消耗大量DSP,而且流水线深度怎么定才能不产生气泡?面试官还追问了边界像素和行缓冲冲突的处理,求大佬给个具体代码框架和时序分析。
2026年FPGA校招笔试题:用Verilog实现一个基于AXI4-Stream的实时图像灰度化,流水线深度怎么设计才能满足4K60帧?
11 个回答

我看到你纠结的是浮点乘法和流水线深度,其实4K60帧的像素时钟大概在600MHz左右,FPGA很难直接跑到这个频率。常见做法是先把系数放大成整数,比如0.299放大到4915(2^14),然后乘完再右移14位,这样只用整数乘加器。流水线深度我一般定3级:第一级三个乘法并行,第二级加法,第三级右移截位,这样每拍出一个结果,不产生气泡。面试官追问的边界像素,你可以在行首和行尾加一个valid掩码,把无效数据掐掉就行。你当前是在仿真阶段还是已经上板测过时序了?

追问行缓冲冲突说明面试官想看你懂不懂DDR带宽和行缓存调度。4K60帧一行大概3840像素,灰度转换只需要当前像素,不需要邻域,所以理论上不需要行缓冲。但AXI4-Stream的tready/tvalid握手会导致背压,如果你用乒乓RAM做行缓存来解耦输入输出时钟域,那就要小心读地址和写地址不碰撞。我建议你画一个简单的状态机:空闲时等待tvalid,拉高tready,然后连续读三个颜色通道——不过AXI4-Stream一般是打包传输的,比如一个像素的R、G、B在同一个数据节拍的高中低字节里,所以你其实不用操心地址冲突。流水线深度按我说的方法设成3级足够,但要给系数和截位加上流水线寄存器,防止关键路径过长。另外,面试官可能会问4K60帧需要多少带宽,你可以算一下:384021606024bit≈12Gbps,AXI4-Stream跑满的话至少需要125MHz位宽128bit的总线。如果你用Xilinx的VDMA,记得关掉帧缓存自动同步,否则会多出一帧延迟。

这个问题其实考的是你对数字图像处理在FPGA上实现时的系统级理解,而不只是单纯写个灰度模块。先说浮点乘法的事,实际工程里没人用浮点,都是定点化。你的系数0.299、0.587、0.114如果用8位精度量化,分别对应76、150、29(乘以256取整),然后三个乘积相加后右移8位。注意这样会损失一点精度,但人眼看不出来。如果你想要更高的精度,可以放大到2^14,就是4915、9620、1868,右移14位。关于流水线深度,4K60帧的像素时钟大约是594MHz,FPGA内部逻辑很难直接跑这么高,所以你必须用多级流水线来拆关键路径。我建议你用三级:第一级做三个乘法,第二级把三个乘积加起来,第三级做截位和输出。每级之间插寄存器,这样每拍都能出一个结果,不会产生气泡。但面试官追问的「流水线深度怎么定才能不产生气泡」,其实隐含了一个前提——你的输入数据必须连续有效。如果上游AXI4-Stream设备偶尔拉低tvalid,你的流水线就会空转,这时候深度多少都没用,关键是做好握手逻辑。我的做法是把tvalid和tready用寄存器打一拍同步到处理时钟域,然后在输入级做一个4深度的FIFO来吸收背压,这样即使上游停一拍,你的流水线还能从FIFO里取数据继续跑。关于边界像素和行缓冲冲突:4K分辨率下,如果灰度转换只依赖当前像素,你不需要行缓冲,直接流式处理就行。但如果你要同时输出灰度图和原始的RGB数据(比如做双路输出),那就要考虑行缓冲来对齐时序。面试官问行缓冲冲突,可能是在试探你知不知道DDR带宽瓶颈——4K60帧未经压缩的RGB数据流带宽大概12Gbps,如果FPGA内部BRAM不够,你只能把行缓冲放到DDR里,这时候读写仲裁就会产生冲突。常见的解决方法是让行缓冲的写时钟比读时钟快一点点,或者用两个缓冲乒乓切换。最后给一个代码框架思路:顶层模块例化三个乘法器和一个加法器,全部用流水线寄存器隔开;AXI4-Stream接口的tdata假设是24位(R、G、B各8位),你按字节位置提取;输出tdata设为8位灰度值;tvalid和tready的时序用状态机控制,确保每拍握手成功才更新寄存器。你如果能把上述定点化、流水线级数选择、背压处理、行缓冲必要性分析都讲清楚,面试官基本就满意了。顺便问一句,你用的开发板是哪个型号?不同系列的DSP切片数量会影响你乘法器并行的策略。

面试官其实不是真要你当场写出完整代码,他看你有没有工程直觉。4K60帧的像素时钟确实高,但你可以先坦白说FPGA需要靠多级流水线拆路径,然后迅速画出三级流水线的框图:乘、加、截位。边界像素?直接说在行首用一个valid掩码把无效节拍屏蔽掉,行缓冲冲突其实不存在的,因为灰度转换是逐像素操作。你是在准备机试还是手撕代码环节?

我建议你换个思路,别总想着在FPGA里硬算浮点。实际工程里都是把系数放大成定点数,比如用2^14量化,0.299变成4915,然后三个乘积加起来再右移14位,这样只用到整数乘加器,DSP消耗能降到3个以内。流水线深度的话,三级就够:第一级三个乘法并行,第二级两个加法器做树形求和,第三级截位输出。关键是要在每级之间插寄存器,这样每拍都能出一个像素,不会有气泡。关于行缓冲冲突,AXI4-Stream通常一次传完一个像素的所有通道,你只需要在tvalid拉高时锁存RGB数据就行,根本不需要行缓存。面试官追问带宽时,你可以算一下:384021606024bit大概12Gbps,AXI4-Stream在600MHz下用32位数据位宽就能勉强跑满,但实际FPGA很难到600MHz,所以建议用DDR或者降低帧率来妥协。你是在做仿真验证还是已经上板跑过时序分析了?

你纠结流水线深度和行缓冲冲突,其实说明你已经踩过一些坑了。我直接说个常见误区吧:很多人以为自己要设计一个乒乓RAM做行缓冲来解耦时钟域,但灰度转换是点操作,不需要邻域数据,所以完全没必要。AXI4-Stream的握手信号tready和tvalid才是你要重点关注的。如果输入时钟域和内部处理时钟域不同,你可以在入口处用一个简单的同步FIFO做跨时钟域,深度设成2或4就够,因为每拍只消耗一个像素。流水线深度我习惯定成4级而不是一般的3级——多一级是因为我把系数预乘也单独拆了一拍,这样关键路径更短。具体来说:第0级把三个系数从ROM里读出来并寄存;第1级并行做三个乘法;第2级用加法树求和;第3级右移截位并打一拍输出。这样每拍都能出一个结果,而且时序余量更大。边界像素处理的话,你可以在最后一拍加一个输出valid生成逻辑:只要输入tvalid有效且内部流水线填满,就把输出tvalid拉高。面试官如果追问行首行尾的无效像素,你直接说用计数器判断当前像素坐标,在行首前几个像素和行尾后几个像素把输出valid拉低就行。顺便提一句,4K60帧的像素时钟确实很高,如果你用的不是高端FPGA,可以考虑把接口降频到300MHz然后内部用双像素并行处理,这样对时序更友好。你现在仿真跑的是单像素还是双像素架构?

看到你在纠结浮点乘法和行缓冲冲突,其实这两个问题背后都指向同一个核心:你是在用软件思维写硬件。灰度公式里的浮点系数在FPGA里从来不是直接用浮点乘的,而是先做定点量化。我推荐你用2^14量化,因为14位精度足够让人眼看不出色差,而且乘法结果在32位以内,不会溢出。流水线深度你定3级是没问题的,但关键不在于级数,而在于你每级之间有没有把寄存器打够。我见过很多同学在写加法树那级只插了一排寄存器,结果关键路径还是从乘法器输出一路穿过两个加法器到截位逻辑,时序根本收不了。正确的做法是:乘法做完之后立刻寄存,第一级加法做完再寄存,第二级加法做完再寄存,最后截位输出。这样每一级之间都有完整的一拍缓冲,4K60帧的像素时钟大概在600MHz左右,虽然FPGA很难直接跑到,但用这种三级全流水结构配合器件本身的DSP48寄存器,通常能压到250-350MHz,再配合DDR带宽降帧率或者用多像素并行,才能实际跑通。至于行缓冲冲突,灰度转换是点操作,不需要邻域数据,所以理论上不需要行缓存。但面试官追问这个,其实是在看你懂不懂AXI4-Stream的背压机制。如果输入时钟域和内部处理时钟域不同步,你可以在入口处放一个深度为2或4的同步FIFO,只用来缓存一拍数据,防止tready拉低时丢数。边界像素的处理更简单,你只需要在行首用一个计数器,在第一个有效像素到来之前,把内部寄存器的初始值清零,然后正常流水即可,不需要额外掩码逻辑。你目前是在做仿真验证还是已经综合跑过时序分析了?
其实我更建议你换个角度准备这道题。面试官让你手写代码,他真正想看的是你能不能快速画出流水线框图,并且在关键路径上标出寄存器位置,而不是纠结于具体语法。你可以先画一个三级流水线的数据流图:第一级三个乘法并行,第二级两个加法器做树形求和,第三级右移截位并输出。然后在每级之间画上寄存器,标注出tvalid和tdata的延迟对齐关系。面试官看到你连tuser或者tlast信号都考虑进去了,他就知道你做过AXI4-Stream的实际项目。另外,你提到消耗大量DSP,实际上定点化之后只用3个DSP48就够了,因为三个乘法可以并行,不占用额外的乘法器资源。如果你用Xilinx的器件,还可以把系数存在BRAM里,通过tdata的像素索引来查表,这样连乘法器都省了,但会多消耗LUT和BRAM,适合LUT多DSP少的芯片。你在准备的时候可以多试试不同量化位数的精度对比,面试官很可能会追问为什么选14位而不是8位或16位。
最后提醒一点:面试官问行缓冲冲突时,你千万不要一上来就说用乒乓RAM,那样反而暴露你还没理解点操作和邻域操作的区别。正确的回答是:灰度转换只依赖当前像素,不需要行缓存,所以不存在行缓冲冲突。但如果输入输出时钟域不同,可以用一个小深度的FIFO做跨时钟域处理,深度设成2就够,因为每拍只消耗一个像素。这样既展示了你的基础知识,又体现出了工程经验。

面试官问流水线深度怎么定才能不产生气泡,其实他真正想听的不是一个固定的级数,而是你推导级数的思路。4K60帧的像素时钟大约是594MHz,FPGA逻辑很难直接跑到这个频率,所以你必须用流水线把组合逻辑拆短。关键路径在哪?在于乘法器输出到加法器输入的那段组合逻辑。灰度转换本质上是一个乘加树:三个乘法并行,然后两级加法求和。如果不插寄存器,乘法器输出要经过两个加法器才能到达截位逻辑,这段路径在工艺上很难在1.5ns内走完。所以流水线深度至少是3级:第一级做完乘法立刻寄存,第二级做第一层加法并寄存,第三级做第二层加法并截位输出。但有个细节很多人会漏掉——系数预取。如果你把系数放在BRAM里,读ROM本身也有一个时钟周期的延迟,那你就需要把系数预取单独拆成第0级,这样流水线就变成4级。面试官追问边界像素时,你直接说灰度转换是点操作,不需要邻域数据,所以行缓冲冲突根本不存在。真正需要处理的是AXI4-Stream的tvalid/tready握手:当tvalid拉低时,你的流水线必须暂停,也就是把寄存器使能信号拉低,防止无效数据被推进流水线。我建议你在入口处加一个简单的握手转译逻辑——当tvalid和tready同时拉高时,才把像素数据锁存到流水线第一级。这样tready拉高表示当前级已经准备好接收数据,如果流水线被填满,tready就拉低,自然产生背压。面试官再追问背压怎么处理,你就说可以用一个深度为2的同步FIFO做缓冲,因为每拍只消耗一个像素,2深足够吸收握手抖动。另外,你的截位用算术右移还是逻辑右移?灰度转换里系数有正有负,但RGB都是无符号数,所以乘积结果一定是正数,用逻辑右移没问题。但如果你用了有符号乘法器,就要小心符号位扩展,最好统一用无符号数处理。你当前是在仿真阶段还是已经写过AXI4-Stream的从机逻辑了?

面试官真正考察的是你对流水线深度的推导过程,而不是背一个固定数字。4K60帧的像素时钟接近600MHz,FPGA很难直接跑,所以必须用流水线把关键路径拆短。灰度转换的乘加树需要三级流水:乘、加、加,每级之间插寄存器。如果你把系数预取也拆成一拍,那就变成四级。行缓冲冲突?灰度转换是点操作,不需要邻域数据,所以行缓冲完全多余。你只需要在入口处用握手信号控制流水线使能,当tvalid和tready同时有效时才推进数据。边界像素直接用valid掩码屏蔽掉行首行尾的无效节拍就行。面试官如果追问带宽,你可以算一下:3840x2160x60x24bit约等于12Gbps,单个AXI4-Stream在594MHz下用32位位宽勉强能跑,但实际FPGA很难到600MHz,所以需要多通道或者用DDR。你是在准备机试还是已经面过一轮了?

灰度转换的流水线深度不是背出来的,是算出来的。你先找出组合逻辑最长的路径——乘法器到加法树末级,然后除以时钟周期,就能算出最少需要多少级寄存器。4K60帧的时钟周期只有1.68ns,乘法器加两级加法肯定超了,所以至少三级。行缓冲?点操作不需要,别自己给自己加戏。你写代码了吗?发出来帮你看看。
发表回答
登录后可在本页底部提交回答