2026年秋招准备海思FPGA岗,面试官让我手撕Verilog实现AXI4-Stream的实时YOLOv8n卷积加速器,追问脉动阵列的DSP共享策略和权重缓冲深度怎么确定。我查了网上资料,有的说用行缓冲加权重预取,但具体深度公式推导不清楚。求大佬给个详细推导过程,包括DSP利用率怎么算、缓冲深度和卷积核尺寸关系,最好有仿真波形参考。
2026年FPGA秋招,海思面试官问AXI4-Stream实时YOLOv8n加速器,脉动阵列DSP共享和权重缓冲深度怎么设计?求具体推导
12 个回答

面试官问这个其实是在看你有没有真正上板调过时序,而不是背公式。DSP共享主要看卷积核大小和输入通道数,一般做法是把多个部分积在一个DSP里做,前提是数据位宽够用。权重缓冲深度等于行缓存行数乘卷积核宽度,公式推起来就是考虑一次处理多少个像素点同时并行。别纠结完美推导,能画出乒乓操作和valid/ready握手时序就赢了八成。

兄弟,你这个问题我去年秋招也被问过类似的,不过不是海思。先说DSP共享策略,YOLOv8n卷积层输入输出通道不多,脉动阵列里每个PE通常处理一个输出通道的一组权重,但DSP资源有限,常见做法是时分复用:让一个DSP在多个时钟周期里轮流计算不同卷积核的部分和,最后累加。这样DSP利用率可以做到接近100%,但代价是控制逻辑变复杂。权重缓冲深度取决于你一次从DDR搬多少权重进来,以及你的脉动阵列能并行处理多少个权重。公式大概是这样:缓冲深度 = ceil(卷积核高度 卷积核宽度 输入通道数 / 并行度) 位宽。但实际设计时还要考虑AXI4-Stream的backpressure,如果下游处理慢了,缓冲会溢出,所以一般再加个FIFO深度余量,比如1.5倍。面试官更想听你推导时考虑到实际流片中的timing closure问题,比如DSP的pipeline stage数和权重读取延迟怎么平衡。建议你画个时序图,把valid/ready握手、权重加载窗口、计算窗口标清楚,比光讲公式有说服力。你目前有试过用Vivado的DSP48E2原语搭过小规模的脉动阵列吗?

针对面试场景,别一上来就推大公式。面试官大概率是想看你对数据流和资源约束的直觉。脉动阵列的DSP共享本质是解决「权重加载」和「计算」的时间重叠问题。权重缓冲深度可以这样推:假设你的脉动阵列是MxN的PE网格,每个PE计算一个输出像素需要KKC_in次乘加。如果DSP能在一个时钟周期内完成一次乘加,那么缓冲深度至少是KKC_in / M,这是为了保证在M个PE并行时,权重供给不中断。但实际还要考虑AXI4-Stream的突发传输长度,一般取2的幂次方便地址对齐。你可以在面试时说:我先按最坏情况算一个理论最小值,再根据仿真波形调整。这样既显得严谨又留了活口。建议你在GitHub上找个开源的卷积加速器工程,看看别人的权重缓冲是怎么切bank的,比闷头推公式快很多。

面试官问这个,其实更想听你讲清楚乒乓操作和valid/ready握手怎么在脉动阵列里保持节奏。DSP共享说白了就一句话:看卷积核里有多少个乘加可以塞进一个DSP里做,前提是数据位宽和时钟频率允许。权重缓冲深度不用硬套公式,你先算一拍能并行处理几个像素,再乘上卷积核宽度和输入通道数,得到一个理论最小值,然后往上加一点余量,比如1.5倍,以防AXI4-Stream反压。重要的是画时序图,把valid、ready、last的配合画清楚,比背公式管用。你目前在用哪个型号的FPGA做原型验证?资源差异会影响DSP共享的策略。

如果你真想弄明白权重缓冲深度怎么推导,别把这件事想太复杂。先抓住脉动阵列执行卷积的本质:它是把一次卷积运算拆成多个时钟周期,每个PE只算一个乘加,然后通过流水线把部分和传给下一个PE。权重缓冲的作用就是保证每个PE在需要权重的时候能立即拿到,不被DDR读延迟卡住。推导可以从最简场景开始:假设你的脉动阵列是8×8的PE网格,每个PE一次只处理一个输入通道的一个权重。那么对于YOLOv8n里典型的3×3卷积、输入通道32,你一次要加载的权重总数是3x3x32=288个。如果每个PE一次只处理一个权重,那缓冲深度至少是288/64=4.5,取整5。但实际设计时,你会把权重按输出通道分bank,每个bank深度对应一个输出通道需要的权重数,这样地址简单。DSP共享策略是另一回事:一般做法是让一个DSP在多个时钟周期里完成多个乘加,比如处理3×3卷积时,一个DSP可以在9个周期内算完一个输出像素的9个乘加,这样DSP利用率接近100%,但控制逻辑要额外处理部分和累加。面试官更愿意听你讲清楚为什么选8×8而不是其他尺寸,以及时序收敛时的关键路径在哪里,而不是纠结那个公式是ceil还是floor。建议你去Xilinx的Vitis HLS里跑个简单的卷积核,看它自动生成的权重缓冲结构,比硬推公式直观多了。你手头有Vivado可以跑仿真吗?没有的话我可以推荐个开源工程。

面试官问DSP共享,有一个坑很多新手会踩:以为DSP共享就是把多个运算塞进一个DSP里就行,没考虑数据位宽和时钟频率的匹配。比如YOLOv8n的卷积输入通常是8位整数,但有些DSP内核支持两个8位乘加同时做,这时候共享策略就变成了怎么把两个不同卷积核的乘法打包进一个DSP。但如果你时钟跑得高,DSP内部流水线级数不够,打包反而会导致时序违例。权重缓冲深度还有一个容易忽略的点:AXI4-Stream的tlast信号处理。当一帧图像传输结束时,缓冲里的残留权重必须清空,否则下一帧会算错。所以缓冲深度设计里要加一个clear逻辑,不是简单加FIFO深度就能解决。我见过有人仿真波形里权重缓冲数据一直正确,但实际板级测试时图像边缘出现伪影,查半天发现是tlast没处理好。建议你在推导完公式后,专门写一段代码处理tlast触发的缓冲重置,面试官如果追问这个细节,说明他懂行。你目前RTL仿真用的是什么工具?不同仿真器对AXI4-Stream的协议检查严格程度不一样,可能会暴露握手逻辑的问题。

海思面试官问DSP共享,其实有个很现实的权衡:你是要追求DSP利用率,还是要追求时序收敛。YOLOv8n里3×3卷积多,但输入通道数可能只有32或64,一个DSP48E2如果只做8位乘加,理论上能塞两个乘法。可实际工程里,我见过有人为了把DSP利用率从70%拉到95%,结果时钟频率从400MHz掉到300MHz,因为打包后的组合逻辑路径变长了。权重缓冲深度更是个坑:你按理论公式算出深度是5,但仿真时发现AXI4-Stream的tvalid偶尔会拉低一拍,这时缓冲如果不够深,权重还没读完就被覆盖了。我建议你先用最坏情况算一个深度,比如一次突发传输最多能发多少个权重,然后在这个基础上加一个FIFO的almost full余量,比如1.2倍。另外,权重缓冲的bank划分别按输出通道来,按PE的行来,这样地址生成简单。你仿真时有试过用随机反压的testbench吗?没有的话建议加上,很多隐藏问题只有反压时才会暴露。

先别急着推公式,你先把YOLOv8n的卷积层参数列出来,比如第一层卷积是3x3x3x32,输入是640×640,那一次计算需要多少权重?3x3x3=27个,每个8位,总共216位。如果你的脉动阵列是4×4的PE网格,每个PE一次处理一个权重,那权重缓冲深度至少是27/16向上取整得2,但这是理想情况。实际中AXI4-Stream的tlast信号会告诉你一帧图像结束,这时候你缓冲里的权重必须全部是下一帧的,所以深度还要考虑乒乓操作的开销。常见的做法是设两个bank,每个bank深度等于一次卷积需要的权重数,这样在计算当前帧时,后台可以预取下一帧的权重。面试官更想听的不是那个数字是多少,而是你推导过程中考虑了多少现实约束:比如DDR带宽够不够在帧消隐期把所有权重搬进来,如果不够,你的缓冲深度就要大到能缓存多个卷积层的权重。DSP共享策略其实和缓冲深度是联动的——如果你让一个DSP分时处理多个乘法,那权重加载的节奏就要跟着变,因为同一个DSP在不同时钟周期需要不同的权重。我建议你画一个时序图,把valid、ready、last和DSP的流水线级数标出来,面试时直接拿这个图讲,比念公式有说服力得多。你在做原型验证时,时钟频率大概定在多少?这会影响你DSP内部流水线要不要插寄存器。

你这个问题其实拆成两块看会清晰很多。DSP共享那块,面试官真正想听的不是你背出一个什么公式,而是你知不知道DSP48E2这种硬核内部有两个乘法器,如果数据位宽允许(比如8位),可以同时做两个乘加,但代价是时钟频率上不去。我见过有人为了省DSP,把两个3×3卷积的部分积硬塞进一个DSP,结果综合后路径延迟超了,最后反而得降频跑。权重缓冲深度更是个工程陷阱:你按理论算出来是4,但仿真时AXI4-Stream的tvalid如果因为后端反压偶尔拉低一拍,缓冲直接欠载,这时候你就得加个almost empty余量。一个比较稳妥的做法是先按最坏情况算一个深度,然后跑一下AXI4-Stream的backpressure仿真,看波形里缓冲的读写指针差,再决定要不要加1.2倍或1.5倍。另外别忽略乒乓操作的开销:两个bank的切换逻辑如果写不好,地址生成会乱。你目前是在用Vivado做仿真吗?不同版本的AXI VIP行为有点差异,建议先确认一下。

海思面试官问这种问题,其实是在考察你有没有真正理解「计算」和「搬运」怎么在时间上重叠。脉动阵列的DSP共享策略,本质上是一个资源与吞吐率的交换。YOLOv8n的卷积层输入通道数小,比如第一层只有3通道,这时候你如果让一个DSP只做一个乘加,利用率很低。常见做法是时分复用:让一个DSP在多个时钟周期里处理不同卷积核的乘加,然后通过累加器把部分和合并。但这里有个坑:DSP内部的流水线寄存器有限,如果你把多个乘法打包进一个时钟周期,组合逻辑路径会变长,时序收敛困难。我自己的做法是先定一个目标频率,比如300MHz,然后反推每个时钟周期能塞几个乘加,再决定是让DSP做2路还是4路共享。权重缓冲深度更依赖你的数据搬运策略。如果你用AXI4-Stream的连续突发模式,一帧图像的数据会源源不断流进来,那么缓冲深度主要取决于脉动阵列的并行度:假设你的PE阵列是8×8,每个PE一次处理一个输入通道的一个权重,那对于3×3卷积、32输入通道,一次需要加载288个权重,缓冲深度至少是288/64=4.5,向上取整到5。但实际中你还要考虑AXI4-Stream的tlast信号:当一帧结束,缓冲里的残留权重必须清空,否则下一帧的起始像素会混入上一帧的权重。所以深度设计里要加一个clear逻辑,或者用双缓冲方案。面试时如果能画出时序图,把tvalid、tready、tlast的配合关系标清楚,再结合一个具体的卷积层参数(比如第一层3x3x3x32)算一遍,基本就能过关。另外建议你去看一下Xilinx的AXI4-Stream Video IP的文档,里面有个例子讲如何用行缓冲做卷积,虽然不直接针对脉动阵列,但握手信号的时序图很有参考价值。
发表回答
登录后可在本页底部提交回答