2026年FPGA校招,海思面试官让手撕Verilog实现AXI4-Stream实时直方图均衡,累积分布函数怎么用流水线实现不丢帧?

开放9 回答 79 浏览

海思面试官上来就给了一道题,让我用Verilog实现一个基于AXI4-Stream的实时直方图均衡模块,要求处理1080P60的视频流。我卡在累积分布函数(CDF)的流水线设计上,怎么才能一边统计直方图一边输出均衡后的像素而不丢帧?是用双buffer乒乓操作还是用BRAM做查找表实时更新?求大佬给个具体架构和代码思路,面试急用。

分享:

9 个回答

  • 电子爱好者小张

    面试官问这个其实是想看你懂不懂乒乓和流水线的时序边界。你只要说清楚:用双BRAM,A帧统计直方图的同时,B帧用上一帧的CDF查表输出,帧消隐期用加法器树把A的直方图算成CDF写入B的查找表。这样每帧都有一帧的延迟,但1080P60的消隐时间够用。别扯实时更新查找表,那反而容易丢数据。你目前用的是哪家的开发板?

  • 递归小菜鸟

    兄弟你这道题我去年实习面另一家也遇到过,核心就一句话:直方图统计和CDF计算不能在同一帧里干。你想想,统计完一帧所有像素才能算CDF,所以必然滞后一帧。面试官期望的答案就是双BRAM乒乓,一个存当前帧的直方图计数,另一个存上一帧算好的CDF查找表。CDF用加法器树流水线,在帧消隐期(大概几百个时钟)把256个bin的累加做完,乘上缩放系数直接写进查找表。输出端就简单了,每个像素进来查表出均衡值。注意AXI4-Stream的ready/valid握手要处理好,消隐期拉低ready让数据等一等。你如果能把乒乓切换的有限状态机画出来,面试官基本就点头了。另外提一句,BRAM用真双口,一个口写直方图,一个口读CDF,带宽够。

  • 代码小萌新

    我换个角度说点你可能没想到的。先别急着上代码,面试官其实在考察你对「统计-计算-输出」三个阶段的时序认知是否清晰。很多人卡在「一边统计一边输出」这个点——实际上实时直方图均衡永远做不到零延迟,因为CDF依赖全帧信息。1080P60每帧大约16.6ms,消隐期约1.2ms,而你的加法器树算256个bin的累加,用流水线8级就能在几百纳秒内搞定,所以时间完全充裕。关键风险在于:如果你用单BRAM同时做统计和查找,写地址和读地址会冲突,必须双口BRAM但也要注意端口分配。另一个常见坑是:消隐期切换BRAM时,AXI4-Stream的tlast和tuser信号要配合好,否则下一帧第一个像素可能读到旧查找表。我建议你画一个时序图:统计帧n时,输出帧n-1的均衡结果;帧n行有效期间,BRAM0被写直方图,BRAM1被读CDF;行消隐或帧消隐期间,用加法器树把BRAM0的直方图算出CDF写入BRAM1。这样每帧只延迟一帧,对人眼几乎不可感知。面试官如果追问延迟能不能缩小,你就说用行级局部直方图可以做,但会牺牲均衡效果,看场景取舍。你目前对AXI4-Stream的sideband信号(比如tkeep、tlast)熟悉吗?

  • 编程入门

    我个人感觉这道题最关键的其实是理清「哪一帧的数据在干什么」。很多人在面试时一上来就画双BRAM乒乓,但面试官追问「什么时候切换读/写口」「消隐期具体做哪几步」就懵了。你只要记住一个原则:第N帧的行有效期间,BRAM0写当前像素的直方图计数,BRAM1读第N-1帧算好的CDF查找表输出均衡值;等到第N帧结束进入消隐期,用一个加法器树流水线把BRAM0里的256个bin累加成CDF,再乘以缩放系数写入BRAM1,同时把BRAM1和BRAM0的角色互换。这个切换点一定要用帧同步信号(比如vde的下降沿或tlast)触发,别在行有效中间切。你目前是把直方图统计和CDF计算放在同一个always块里还是分开了?

  • 编程小菜

    其实面试官问这个,除了看乒乓架构,还会挖一个坑:你打算把CDF计算的加法器树做成几级流水?有人上来就说8级256个bin,但没注意BRAM读延迟。一般BRAM读出来要一个时钟,如果你的加法器树第一级直接读BRAM输出,那组合逻辑路径可能太长。常见做法是先把BRAM输出打一拍,再做加法器树,这样总共需要log2(256)=8级加法加上1级打拍,一共9个时钟,在1080P60的消隐期(大概一千多个像素时钟)里完全够用。另外输出端的缩放系数乘法器也可以用DSP48,别用LUT拼,不然资源会爆。你如果能当场写出加法器树的verilog代码框架,面试官基本就满意了。顺带一提,海思有些部门喜欢追问跨时钟域处理,如果输入时钟和内部逻辑时钟不同频,记得加异步FIFO。

  • 单片机玩家小刘

    这道题想拿高分,不能只讲架构,得把AXI4-Stream的握手协议跟乒乓切换的时序咬合讲清楚。很多人以为消隐期就是拉低tready让数据停,但实际上一帧结束后tlast拉高,紧接着可能有tuser带的行场同步信息,如果你在tlast之后立即切BRAM,可能漏掉帧尾的几个像素。稳妥的做法是:用vde(视频数据使能)的下降沿作为帧结束标志,在vde拉低后等一个时钟再触发状态机切换。切换时先让加法器树开始读BRAM0的直方图,同时把BRAM1的读地址清零准备好给下一帧输出用。这中间有个容易被忽略的点:加法器树流水线在消隐期算CDF时,BRAM0的写端口必须被释放,因为下一帧还没开始,你可以在状态机里加一个idle态专门做这件事。如果你用vivado,建议开个ila抓一下tlast和BRAM的we信号,确保切换时刻没有毛刺。至于代码风格,面试官一般期望你按模块划分:统计模块、CDF计算模块、查表输出模块,每个模块用单独的always块,方便他追问时序约束。你准备面试的时候,可以自己在vivado里搭个testbench,用随机像素模拟一帧数据,看看输出均衡后的图像是不是累积分布近似直线。这样面试时你就能说「我已经仿真验证过」,比纯口述强很多。你目前有做过类似的图像处理仿真吗?

  • 电路设计初学者

    其实面试官真正想听的不是你背出双BRAM乒乓,而是你怎么处理那个切换时刻的毛刺。你看,统计阶段BRAM的写地址是像素值,读地址是CDF查表的索引,这两者在一个双口BRAM上可以并行,但一旦进入消隐期,你要把写口释放给加法器树去写CDF结果,读口则继续给输出端查表。这里有个容易翻车的地方:如果你在vde下降沿直接切状态机,加法器树可能还在算上一帧最后几个bin的累加,而BRAM的写口已经被你切成了CDF写入模式,会导致直方图数据没写完就被覆盖。稳妥的做法是在vde下降沿之后,先让加法器树从BRAM0读完256个bin,算完CDF并写回BRAM1,再互换角色。这中间大概需要十几个时钟的额外等待,但相对于消隐期一千多个时钟来说完全够用。你可以在状态机里加一个WAIT_DONE状态,等加法器树的done信号拉高再切换。另外,如果你用Xilinx的BRAM,记得把读优先模式改成写优先,不然读CDF时可能会读到旧的脏数据。你目前写代码时用的是单时钟域还是有多时钟域?

  • Verilog小白2024

    我换个角度说,这道题其实考的是你对「统计-计算-输出」三阶段流水线在像素时钟粒度上的掌控力。很多应届生会犯一个错误:以为帧消隐期很长,就把CDF计算做成一个串行累加,每个时钟加一个bin,256个时钟搞定。但问题是,1080P60的消隐期只有大概1.2ms,对应148.5MHz下约178万个时钟周期,串行累加完全来得及,为什么还要用加法器树?面试官要的是你对资源与延迟的平衡理解。加法器树的好处是把延迟从256个时钟降到log2(256)=8个时钟,但代价是多用了大量LUT和进位链。如果你用的FPGA逻辑资源紧张,比如某些低成本器件,串行累加反而更省资源。但海思面试官大概率想看你用加法器树,因为能体现你对流水线级数和BRAM读延迟的考量。我建议你这么做:先定好BRAM读延迟为1拍,把读出的bin值打一拍再送进加法器树第一级,这样总共9拍出结果。输出端那个缩放乘法器,系数是255/总像素数,这个除法可以用移位加乘法近似,或者直接用DSP48做定点乘法。你如果能当场画出状态机跳转图和加法器树的数据流图,面试官基本就满意了。另外提一句,AXI4-Stream的tkeep信号在视频流里一般不用,但tuser可能会带行场同步,记得在帧首时把查找表地址清零。你用的BRAM是单口还是双口?

  • 嵌入式小白成长记

    海思这道题说白了就是双BRAM乒乓加加法器树流水线,帧消隐期算CDF,下一帧查表输出。别在实时更新查找表上钻牛角尖,那会搞乱时序。你当前是卡在Verilog代码怎么写还是原理没想通?

登录后可在本页底部提交回答

提问者

学习Coding查看主页
浏览「其他」

描述场景与已尝试方案,更容易获得有效解答

相关问题

同分类

提问建议

  • 标题写清核心疑问,避免「求助」「请问」等空泛用语
  • 正文补充环境、版本、报错信息或截图
  • 先搜索本站是否已有相近问题,减少重复提问
  • 若与课程相关,请标明课时或章节便于讲师定位