2026年FPGA校招,手撕Verilog实现AXI4-Stream实时图像缩放,双线性插值行缓冲深度到底怎么算?求具体推导和边界处理

开放12 回答 67 浏览

面试官让我手撕一个AXI4-Stream的实时图像缩放模块,双线性插值那种,我大概知道原理,但行缓冲深度怎么算?比如输入1920×1080,输出1280×720,缩放比0.666,行缓冲要存几行?还有边界像素怎么处理才能不丢帧?求大佬给个具体推导和Verilog代码框架,最好能直接套用。

分享:

12 个回答

  • EE学生一枚

    兄弟,行缓冲深度其实就两行加几个像素。双线性插值每次需要上下两行的像素,所以最少得存两整行。你那个1920×1080缩到1280×720,像素时钟域处理时,行缓冲用双口RAM或FIFO,深度设成输入行宽(1920)再加几个备用地址就行。边界的话,复制最边缘像素做padding,别用补零,不然缩放后图像边缘会发黑。追问一句:你面试时要求同步AXI-Stream握手信号tready/tvalid了吗?

  • Linux菜鸟

    其实你问的这个问题,面试官真正想考察的不是你会不会背公式,而是你能不能把流式数据处理和存储开销算清楚。先说行缓冲深度:双线性插值需要两行数据同时可用,所以最少两行。但注意,因为你是实时流式处理,输入一行数据要边收边算,输出一行时还得等下一行来才能完成插值,所以硬件上至少存两整行。具体到1920×1080缩1280×720,缩放比0.666,像素时钟域如果输入和输出不同步,行缓冲可能要再加一行做乒乓操作,避免读写冲突。深度就是2行或3行,每行1920个像素,每个像素按你的位宽算。边界处理有个常见坑:很多人直接补零,结果图像边缘出现黑边或锯齿。正确做法是复制最边缘像素,比如第一行上面复制第一行,最后一行下面复制最后一行,左右两侧同理。这样插值时边界像素的权重计算才自然。代码框架上,你可以用双口RAM做行缓冲,状态机控制读写地址,双线性插值用一个乘累加器算四个像素的加权和。最后提醒一句:面试官大概率会追问你AXI-Stream的tlast信号怎么对齐输出帧,这个别忘了准备。

  • 单片机初学者

    行缓冲深度这事,别被缩放比带偏了。双线性插值只依赖相邻两行,跟缩放比没关系。你1920×1080输入,行缓冲深度就是2行,每行1920个像素。如果输出时钟域比输入快,可能加一行做跨时钟域缓冲,但那属于FIFO深度问题,不是插值本身需要的。边界处理就记一条:复制边缘像素,别补零。补零在边界处会产生错误的插值结果,因为权重算出来是半黑半正常。你写Verilog时,用两个行FIFO串联,数据流先入FIFO1,再溢出到FIFO2,每次从两个FIFO同时读四个像素(左上、右上、左下、右下),注意最右边一列要复用前一列的像素。代码别写太复杂,面试官看的是你思路清晰,不是代码多华丽。

  • FPGA小学生

    行缓冲深度的核心就一句话:双线性插值需要同时访问两行数据,所以至少两个行缓冲。你1920×1080的输入,每行存1920个像素,深度就是2行。缩放比0.666不影响这个数字,它只决定输出像素的坐标计算。边界处理推荐复制边缘像素,比如第一行上面复制第一行,左右两边也复制最边上一列,这样插值结果自然。代码上,用两个FIFO串起来,数据先写FIFO1,溢出的自动进FIFO2,每次从两个FIFO同时读四个像素。追问:你面试时是要求纯手写代码,还是可以画框图讲思路?

  • FPGA萌新

    其实面试官让你手撕这个模块,重点不是看你能不能写出完美代码,而是看你对流式数据处理的存储开销有没有概念。行缓冲深度最少两行,但你要考虑一个隐藏点:输出时钟域和输入时钟域可能不同步。如果输出比输入快,可能得加一行做异步FIFO缓冲,防止读空。这时候行缓冲就变成3行,但第三行是给跨时钟域用的,不是插值本身需要。边界处理有个常见误区:有人用补零然后截断,结果图像边缘出现黑线。正确做法是复制最边缘像素,比如第一行上面复制第一行,最后一行下面复制最后一行,左右两侧同理。这样插值权重计算才准确。代码框架上,我建议用双口RAM实现行缓冲,地址按行写入,读的时候同时读当前行和上一行。追问:你用的FPGA器件是7系列还是UltraScale?不同系列的BRAM配置方式不一样,影响行缓冲的实现。

  • Verilog小白在线

    行缓冲深度这个问题,我建议你从面试官的视角反过来想。他问的不是你能不能背出2行这个数字,而是你知不知道为什么是2行,以及实时流式处理和离线处理的区别。双线性插值在数学上只依赖相邻两行,所以硬件上最少存两整行。但面试官会追问:如果输入数据是连续的AXI4-Stream流,你收完一行数据后,下一行还没来,这时候你算不了输出,怎么办?答案是你需要等两行都收完才能开始输出第一行,所以行缓冲的深度是2行,但输出会有2行的行延迟。别小看这个延迟,面试官很看重你能否说清楚时延和存储的trade-off。边界处理上,复制边缘像素是最工程化的做法,但要注意:复制操作本身也消耗时钟周期,你需要在状态机里专门处理边界情况,比如第一行和最后一行的行首行尾。代码实现时,我建议用两个独立的行FIFO,而不是一个深度为2行的FIFO。因为两个独立的FIFO可以同时读,方便你取四个像素。追问:你目前能跑通简单的AXI4-Stream握手信号tready/tvalid吗?如果还不太熟,建议先拿一个纯流式FIFO练手,再套插值逻辑。

  • 逻辑小白

    兄弟,行缓冲深度这事真别被缩放比带偏了。双线性插值只依赖相邻两行,所以最少存两整行,跟0.666还是0.5没关系。但面试官实际想听的是延迟代价——你收完第一行不能马上算,得等第二行进来才能开始输出第一行,所以输出会有两行延迟。边界处理上,复制边缘像素是工程标准,但写代码时注意:复制操作本身也会消耗时钟周期,你需要在状态机里专门处理第一行和最后一行的行首行尾。我建议用两个独立的行FIFO串联,而不是一个深度为两行的FIFO,这样读地址控制更灵活。还有一个坑:如果你输出时钟比输入快,可能得加一行做异步FIFO,防止读空,这时候行缓冲就变成三行了。追问:你面试时是手写纯RTL,还是可以画状态机加框图?不同公司要求不一样。

  • 电路板玩家小王

    其实面试官让你手撕这个模块,核心考察点不是你会不会背双线性公式,而是你有没有实时流式处理的面积-时延权衡意识。行缓冲深度最少两行,但推导要分两步走:先数学上,双线性插值需要同时访问上下两行各两个像素,所以硬件上必须同时提供两行数据;再工程上,AXI4-Stream是连续流,你收完一行后下一行还没来,此时第一行数据不能丢,所以得存着,因此最少两行。1920×1080缩1280×720,每行存1920个像素,深度就是2行。边界处理有个常见误区:有人用补零然后截断,结果图像边缘出现黑线。正确做法是复制最边缘像素,比如第一行上面复制第一行,最后一行下面复制最后一行,左右两侧同理。代码框架上,我建议用双口RAM实现行缓冲,地址按行写入,读的时候同时读当前行和上一行。缩放比0.666只影响输出像素的坐标计算(用定点数算插值权重),不影响行缓冲深度。还有一个隐藏点:如果你输出时钟域比输入慢,行缓冲反而可能溢出不?不会,因为输出像素数少,只要握手信号处理得当,反压机制会控制输入流。追问:你用的FPGA器件是7系列还是UltraScale?不同系列的BRAM配置方式不一样,影响行缓冲的具体实现。

  • Verilog入门生

    我猜你纠结行缓冲深度,是因为网上很多教程把缩放比、行缓冲、插值行数混在一起讲。其实核心只有一条:双线性插值无论缩放比是多少,永远需要同时访问两行数据——当前行和上一行。所以行缓冲最少存两整行,1920×1080的输入每行存1920个像素,深度就是2行。缩放比0.666只影响输出像素的坐标递推,跟存储深度没关系。边界处理有个容易忽略的点:复制边缘像素时,第一行和最后一行需要额外一个状态机状态,比如你先收满一行,等第二行来了才开始输出第一行,这时候第一行像素的上方邻居就是它自己。代码上我建议用双口RAM做行缓冲,写地址循环递增,读地址同时产生两个,一个读当前行,一个读上一行。注意读地址要滞后写地址一个时钟,避免读到脏数据。如果你面试时被问到输出延迟,可以提一句:这种结构输出会比输入晚两行加几个时钟,属于正常流式延迟。追问:你面试官有没有要求处理帧同步信号tlast和tuser?这个经常被问但容易被忽略。

  • 数字电路学习者

    兄弟,说个面试官真正想听但你大概率没准备的点。行缓冲深度确实是两行,但面试官问完这个之后,通常会立刻追问:如果输入是AXI4-Stream,tvalid和tready握手时数据不连续怎么办?很多人会蒙,因为他们默认数据是连续流。实际上,握手信号会导致数据流中插入气泡(空拍),这时候你的行缓冲控制逻辑必须能处理tvalid拉低的情况。比如你收完一行最后一个像素时,tready拉低,下一行数据还没来,此时行缓冲里的数据不能被新覆盖,要等tvalid再次拉高才继续写。所以行缓冲深度两行只是数学上的最小值,工程上还要考虑握手停顿导致的地址重叠问题。我建议你在状态机里用行计数器加像素计数器,每次收到tvalid且tready时再更新地址。边界处理方面,复制边缘像素的做法是对的,但要注意:在输出最后一行时,你需要把倒数第二行数据再读一次作为当前行的复制,否则最后一行下面的像素会丢失。代码框架你可以参考Xilinx的video processing IP设计思路,用两个独立的行FIFO串联,第一个FIFO写满一行后开始写第二个,同时从两个FIFO读数据做插值。追问:你准备用BRAM还是分布式RAM实现行缓冲?1920像素每像素8位的话,两行就是30Kb,用BRAM更省面积,但面试官可能会问你BRAM的读写时序怎么配。

登录后可在本页底部提交回答

提问者

HelloWorld查看主页
浏览「其他」

描述场景与已尝试方案,更容易获得有效解答

相关问题

同分类

提问建议

  • 标题写清核心疑问,避免「求助」「请问」等空泛用语
  • 正文补充环境、版本、报错信息或截图
  • 先搜索本站是否已有相近问题,减少重复提问
  • 若与课程相关,请标明课时或章节便于讲师定位