2026年FPGA校招,手撕Verilog实现AXI4-Stream实时HDR融合,多帧曝光怎么用流水线对齐才能不丢帧?

开放9 回答 47 浏览

2026年FPGA校招,海思面试官让我手撕Verilog实现一个AXI4-Stream的实时HDR融合,多帧曝光怎么用流水线对齐才能不丢帧?我大概知道要用行缓冲和帧缓存,但具体怎么设计流水线深度和同步信号?求大佬给个详细推导和代码框架,最好有仿真波形图。

分享:

9 个回答

  • 电路学习中

    面试官让你手撕HDR融合,核心是想看你有没有处理跨时钟域和多帧同步的经验。简单说,三帧曝光(短、中、长)进来,你先把它们各自写入独立的FIFO,然后用最长曝光帧的像素时钟作为输出时钟,统一读出。对齐的关键是:短帧的FIFO深度要能缓存整帧,等中帧和长帧的行计数器追上短帧的起始位置,再一起送出行缓冲做加权。流水线深度由最长和最短曝光行数的差值决定,比如最长曝光用5行,最短用2行,那深度就是3行。别想着用状态机去等帧,那样会丢数据。仿真时重点看各个FIFO的空/满标志和行同步信号的对齐波形。你当前是在准备秋招还是春招?

  • 电子技术探索者

    大佬们讲的流水线方案我没啥补充的,但想提醒一个容易被踩的坑:帧同步信号的处理。面试官可能故意让你用AXI4-Stream,这意味着tvalid和tready的握手不能随便打断。你如果为了对齐,在中间阶段拉低tvalid去等帧,那上游可能会丢数据或断流。正确做法是把所有输入帧先缓存到行缓冲里,等三帧都存够对齐所需的行数后,再通过一个仲裁器把加权结果发送到输出通道,期间保持tvalid一直有效。另外,加权系数别用浮点,用定点数移位实现,比如1/2、1/4这种,省资源。你问流水线深度怎么定,其实取决于你用的曝光行数差,但一般不超过5行,因为HDR融合对时延不敏感,多几拍没事。真要深究,可以画个时序图,标出每帧的帧同步上升沿和行同步位置,差值就是深度。你目前手上有能跑仿真的FPGA板子吗?可以写个小模块验证下。

  • 数字系统初学者

    别把这个问题想得太玄乎,它本质上是一个经典的'多路视频流对齐'问题,只不过套了HDR和AXI4-Stream的壳。我拆解一下面试官的考察点:第一,你对AXI4-Stream握手机制是否敏感——tvalid/tready的backpressure怎么处理,尤其是多帧同时握手时,如果某一路ready还没准备好,你是直接hold所有路,还是分开处理?第二,你对流水线深度的推导有没有工程直觉。举个例子,假设短曝光帧每行1000像素,长曝光帧每行3000像素,那长帧读完一行时短帧已经读了3行。如果你想让它们在输出端按像素对齐,就得给短帧补2行的延迟,这就是行缓冲的深度。第三,你提到帧同步,其实用FIFO做帧级缓存是浪费资源的,因为HDR融合通常只要求行对齐,不要求帧对齐。你只需要在短帧的写地址上加一个可配置的偏移量,让它的读地址比长帧晚若干行出发就行。具体代码框架:写三个RAM,分别存三帧的当前行数据,用同一个读时钟和读地址,写时钟各自独立;读的时候根据曝光比算加权系数,组合输出。注意AXI4-Stream的tuser信号要携带帧起始标志,否则下游不知道哪里是新帧。仿真波形图你可以在Vivado里用testbench生成,重点观察三个读使能信号是否在同一时刻拉高。最后,面试官如果追问'丢帧'场景,你就说用FIFO的almost_full阈值做反压,或者在输入侧加一个小缓存来吸收帧间隔抖动。这条路走到黑,其实就是ISP pipeline里很常见的'line buffer alignment'技巧。你如果有兴趣,可以看看Xilinx的HDR参考设计白皮书,里面框图很清晰。不过话说回来,校招面试一般不会让你写出完整代码,能把握手、对齐、深度推导这三个点讲明白,再加个伪代码,基本就过关了。

  • 数字IC萌新

    别纠结帧缓存整帧,面试官其实想看你用行缓冲做对齐的思路。短帧比长帧跑得快,你就给短帧插FIFO延迟,长帧用移位寄存器拖几拍,深度等于曝光行数差。加权系数用移位实现,别上乘除法。你手上有Xilinx的板子吗?可以先写个testbench看看tvalid有没有被意外拉低。

  • 逻辑芯片爱好者

    你的框架方向没问题,但有个细节容易被忽略:AXI4-Stream的tready信号不能随便回压,否则上游可能断流或丢帧。正确做法是在帧同步阶段用FIFO把短曝光帧缓存起来,等长曝光帧的行计数器走到对应位置时再读出,这样短帧的写使能不会因为等待而被打断。流水线深度我建议你先算出最大曝光行数差,比如长帧一行1000像素、短帧一行500像素,那短帧每读两行就得等长帧一行,深度至少设成2。实际实现时深度再加2拍裕量,防止握手抖动。加权平均那级记得用定点数,比如1/2、1/4这种用右移实现,不要用浮点IP,面试官一看就知道你有没有工程经验。另外仿真时重点看行同步信号的对齐波形,如果短帧的hsync比长帧早到,你需要在FIFO读侧加一个计数器,等到长帧的hsync拉高再开始读。你目前是在准备秋招还是春招?如果时间紧,可以先写个简化版只对齐两帧,面试时再提三帧扩展思路。

  • 电子技术新人

    面试官问这个其实是在考察你处理多路流式数据的直觉。你不用把三帧都缓存整帧,那样太浪费BRAM。只缓存短曝光帧,因为短帧跑得快,长帧慢,所以长帧只需要用移位寄存器延迟几拍就行。流水线深度就等于长帧行像素数除以短帧行像素数,取整再加1。比如长帧每行2000像素、短帧1000像素,深度就是3。同步信号那块,你只要在帧同步阶段用fifo把短帧的tvalid和tdata存起来,等长帧的行同步到来时一起读出,然后做加权。加权系数提前算好存成常数,用移位实现。你仿真时记得检查fifo的空标志,别让读侧在空的时候还拉高tvalid,那样会输出无效数据。

  • 电路设计新手

    兄弟,你问流水线深度怎么定,其实核心就一句话:让短帧等长帧,别让长帧等短帧。你想象一下,短曝光帧每行跑得快,比如一行只有500个像素,长帧一行有2000个像素,那长帧读完一行的时候,短帧已经读了4行。如果你想让它们在输出端按像素对齐,就得给短帧插3行的延迟,这就是行缓冲的深度。具体做法是:帧同步阶段用FIFO把短帧的整行缓存起来,等长帧的行同步到来时再读出;长帧那边不用缓存,直接过移位寄存器拖几拍就行,因为长帧本身就跑得慢。流水线深度就等于长帧每行像素数除以短帧每行像素数,取整再加1,再加2拍裕量防止握手抖动。深度一般不超过5行,因为HDR融合对时延不敏感,多几拍没事。加权系数用移位实现,比如1/2、1/4这种,别用乘除法,面试官一看就知道你有没有工程经验。仿真时重点看tvalid和tready的握手波形,确保短帧的FIFO读侧不会在空的时候还拉高tvalid,否则会输出无效数据。另外,AXI4-Stream的tready不能随便回压,否则上游可能断流或丢帧,所以帧同步那级要保证写使能不被打断。你目前是在准备秋招还是春招?如果时间紧,可以先写个testbench跑通基本对齐逻辑,再考虑边界情况。

  • 嵌入式学习ing

    我补充一个容易被忽略的点:帧同步信号的处理。面试官让你用AXI4-Stream,意味着tvalid和tready的握手不能随便打断。你如果为了对齐,在中间阶段拉低tvalid去等帧,那上游可能会丢数据或断流。正确做法是把所有输入帧先缓存到行缓冲里,等三帧都存够对齐所需的行数后,再通过一个仲裁器把加权结果发送到输出通道,期间保持tvalid一直有效。流水线深度由最长和最短曝光行数的差值决定,比如最长曝光用5行、最短用2行,那深度就是3行。你手上有能跑仿真的FPGA板子吗?可以先写个小模块验证下行同步的对齐波形。

  • Verilog代码小白

    你提到用三级流水线,帧同步、曝光对齐、融合输出,这个框架方向是对的,但有个容易被忽视的细节——AXI4-Stream的握手机制决定了你不能在流水线中间随便拉低tvalid去等数据。很多面试者一上来就写状态机,在帧同步阶段让短帧的FIFO写使能断断续续,结果仿真时tvalid一抖,上游直接丢帧。正确做法是:帧同步阶段只做写操作,短帧数据源源不断写入FIFO,写使能一直有效;对齐阶段才控制读使能,等长帧的行计数器走到对应位置再读出。这样短帧的写路径永远不会被打断。至于流水线深度,我建议你先画个时序图,把三帧的行同步信号标出来,假设短帧每行500像素、中帧1000、长帧2000,那短帧读完一行时中帧才读了一半,长帧才读四分之一,所以短帧要缓存的深度就是长帧行像素数除以短帧行像素数,取整再加2拍裕量,防止握手抖动。你目前是在做校招项目还是已经投了简历?如果是后者,面试官可能更关心你仿真时报了哪些warning,比如FIFO的空标志有没有误判。

登录后可在本页底部提交回答

提问者

数字电路入门生查看主页
浏览「其他」

描述场景与已尝试方案,更容易获得有效解答

相关问题

同分类

提问建议

  • 标题写清核心疑问,避免「求助」「请问」等空泛用语
  • 正文补充环境、版本、报错信息或截图
  • 先搜索本站是否已有相近问题,减少重复提问
  • 若与课程相关,请标明课时或章节便于讲师定位