2026年FPGA校招面试,手撕Verilog实现AXI4-Stream实时视频拼接,多路输入帧对齐怎么设计才能不漏帧?

开放10 回答 67 浏览

最近面试FPGA校招岗位,面试官让我手撕Verilog实现一个AXI4-Stream实时视频拼接模块,要求4路1080P60输入,拼接成2×2的大画面。我卡在了多路输入帧对齐的问题上:各路摄像头帧率有微小差异,导致拼接时画面撕裂或者漏帧。面试官提示用行缓冲和帧同步信号,但具体怎么设计流水线才能保证不漏帧?求一个具体的Verilog设计框架,最好能给出行缓冲深度计算方法和对齐逻辑的代码片段。

分享:

10 个回答

  • 代码焊工

    面试官问这个,其实重点不是让你现场写出完整AXI4-Stream接口,而是考察你对帧对齐和流水线稳定性的理解。四路1080P60,帧率差异来自晶振偏差或者PLL抖动,常见做法是用一个全局帧同步信号,比如选择其中一路作为主帧,其余三路检测到主帧的VSYNC后,开始读自己的行缓冲,同时用一个FIFO做相位补偿。行缓冲深度至少需要一行像素数乘以最大帧偏移的行数,一般按2行算就够,因为晶振偏差在几帧内不会积累到一行以上。漏帧的原因是读指针追上了写指针,解决办法是让从路的FIFO深度略大于主路的FIFO深度,并在拼接完成时丢弃旧帧数据。你面试时画一个简单的状态机,说明写使能、读使能和帧对齐标记怎么握手就行。追问一句:你用的摄像头是MIPI还是SDI?接口不同,对齐逻辑的延迟约束差别挺大的。

  • 电子萌新

    我觉得面试官更想看你有没有工程上的权衡意识,而不是死记硬背代码。四路1080P60,每路像素时钟大约148.5MHz,四路加起来带宽压力不小。帧对齐的核心矛盾是:各路的帧起始时刻不同,但输出必须按统一时序送出。我的做法是,每路输入先过一个异步FIFO,把像素时钟同步到本地拼接时钟域,同时FIFO的写使能由各路自己的帧同步控制,读使能则由一个全局的读调度器统一发出。读调度器在检测到所有路的FIFO非空且帧起始标志都有效后,才开始依次读数据。这样就不会漏帧,因为读操作被延迟到所有路就绪。但代价是会产生1-2帧的额外延迟,面试官如果追问延迟能不能优化,你可以说用行缓冲做亚帧对齐,只延迟几行。行缓冲深度算一下:1080P一行1920像素,每像素24bit,两行缓冲大约需要1920242=92160bit,用BRAM实现很轻松。你写代码时注意把读使能打成流水线,避免组合逻辑扇出太大。至于手撕代码,建议你先写一个单路行缓冲的模块,再写一个四路仲裁器,面试官一般会给时间让你改。你目前是在准备春招还是秋招?不同阶段复习重点不太一样。

  • 技术萌芽

    这个问题其实暴露了一个常见的校招误区:很多人以为帧对齐就是等所有帧的VSYNC同时到来再处理,但真实系统中各路的VSYNC上升沿可能错开好几个像素周期甚至几行。面试官要的不是一个完美的对齐方案,而是你能否意识到,实时视频拼接本质上是一个多生产者单消费者的流水线调度问题。我建议你这样设计:第一,每路输入用FIFO做跨时钟域处理,FIFO深度至少为一行像素数加上最大帧偏移对应的像素数。1080P60一行时间约16.7微秒,晶振偏差按50ppm算,一帧内最大偏移约0.83纳秒,积累几十帧才可能超过一个像素周期,所以实际设计中按两行深度就够了。第二,对齐逻辑不要依赖全局复位,而是靠数据流中的帧起始标记。你在每路FIFO写数据时,把VSYNC拉高的时刻标记为帧头,并在FIFO数据中插入一个标志位。读端同时监控所有路的FIFO,当检测到所有路的帧头标志都出现后,才开始顺序读出数据。第三,为了防止漏帧,当某一路的FIFO因为帧率偏快而写满时,你需要主动丢弃该路当前帧的剩余数据,相当于做一次帧丢弃,保证流水线不卡死。这个丢弃逻辑可以用一个计数器控制,当检测到帧头后计数到一行的像素数,如果下一帧头提前到来,就复位并丢弃当前行。面试时你可以在白板上画一个四输入FIFO的读写时序图,标注出帧头对齐窗口和丢弃时机。另外,AXI4-Stream的TUSER信号可以用来传递帧起始,TLAST传递行尾,这样拼接模块的输入接口可以复用标准协议。你如果能把TUSER和TLAST的生成逻辑写清楚,面试官会觉得你很熟悉协议细节。最后提醒一句,手撕Verilog时不要纠结于完整语法,用伪代码或者always块加注释说明意图就行。你目前在用Vivado还是Quartus?工具不同,综合时对FIFO的原语调用方式也有差异,可以提前准备一下。

  • 芯片设计新人

    漏帧的核心是写时钟和读时钟不同步,不是你代码写得不够花哨。四路1080P60,每路像素时钟差几十ppm,一帧下来偏移不到一个像素,真正要防的是帧起始偏差。你每路FIFO深度设成两行加一个像素就够了,读端等所有路都写满一行再统一读,别等整帧。面试官要听的是你怎么处理那个"等"的时机,不是背FIFO深度公式。

  • 逻辑电路学习者

    个人感觉你被面试官带偏了,他问帧对齐,但你真正该展示的是对AXI4-Stream握手机制的理解。四路输入,每路都有自己的tvalid/tready握手,拼接模块内部用状态机管理读调度。我的做法是:每路FIFO深度设成19202(两行),写端把帧起始标记(比如vsync上升沿)编码成数据包头的TUSER位。读端状态机有三个状态——IDLE、WAIT_ALL、STREAM。IDLE检测到第一路有帧头就进WAIT_ALL,等所有路都出现帧头后统一切到STREAM,按2×2顺序轮流读。这样漏帧只可能发生在某路FIFO溢出,所以FIFO深度要留余量。你追问面试官一句:拼接输出时钟是不是和输入同源?不同源的话还要加CDC,对齐逻辑就复杂多了。

  • 逻辑综合小白

    你这个问题我去年帮学弟改过代码,他当时也是死磕帧对齐。先说行缓冲深度计算:1080P60一行1920像素,每像素24bit,两行缓冲需要1920242=92160bit。但这是理想情况,实际要考虑两件事——第一,各路的PLL抖动可能让行周期差几个像素时钟,所以深度要按1920+最大行偏移来算,常见做法是取2048;第二,拼接输出时钟频率必须高于输入时钟频率的4倍(纯轮询读出),或者用双端口RAM做乒乓操作。你代码里可以用一个计数器记录每路的行号,当所有路的行号都大于0时才开始拼接,这样能避免第一帧的碎片数据。但面试官如果追问延迟,你要说清楚这个方案会引入1帧的等待延迟。另外有个坑:有些面试官会故意说"用全局复位对齐",千万别接话,全局复位在视频系统里会导致帧相位跳变,漏帧更严重。你设计对齐逻辑时,把帧头检测和FIFO空标志做逻辑与,比单纯依赖vsync边沿靠谱。最后问一句:你面试时他有没有提拼接输出分辨率是3840×2160?那个时钟域处理才是真正的考点。

  • EE萌新求带

    面试官让你手撕这个模块,其实真正想看你的是对异步时钟域处理和多消费者仲裁的工程直觉,不是非要你背出一段能直接上线的Verilog。你先想清楚一个核心矛盾:四路1080P60的像素时钟虽然名义上都是148.5MHz,但实际晶振偏差和PLL抖动会让每路的VSYNC上升沿错开几个像素周期甚至一两行。如果你用全局复位去对齐帧起始,那相当于强行让一路去迁就另一路,结果就是某路FIFO读空或者写溢出——这就是漏帧的根源。正确做法是把每路输入先各自过一个异步FIFO,写时钟用自己的像素时钟,读时钟统一用拼接模块的输出时钟。FIFO深度怎么算?一行1920像素,每像素24bit,但你不能只算一行,因为帧起始偏差可能累积到一行以上。工程上一般取两行深度,也就是1920242=92160bit,用一块BRAM就能实现。对齐逻辑不能依赖VSYNC边沿,而是要把VSYNC的有效电平编码成数据包头的一个标志位,比如TUSER的某一位。读端状态机在IDLE状态检测到任一路FIFO非空且包头标志有效后,进入WAIT_ALL状态,等所有路的FIFO都出现包头标志,再统一开始轮询读出。这样输出的每一帧都是从四路同时开始的,画面不会撕裂。但代价是引入了一帧的等待延迟,面试官如果追问能不能优化,你可以说用行缓冲做亚帧对齐——只等所有路都写完第一行就开始拼接,延迟降到一行左右,但需要额外逻辑处理跨行边界。最后补一句,面试时别傻写代码,画个状态机加FIFO读写时序图,比敲几百行Verilog更能让面试官点头。你用的仿真工具是Vivado还是Modelsim?不同工具的异步FIFO例化模板不太一样,准备时最好统一用Xilinx的原语。

  • Verilog入门者

    我去年面过类似题,面试官当场说了一句很有用的话:帧对齐不是在时间轴上对齐,是在数据流上对齐。你每路输入先把VSYNC打成TUSER的帧起始标记,写到FIFO里,读端等所有路都读到了这个标记,才开始按顺序出数据。这样哪怕各路帧起始差了几百个时钟周期,输出画面也是完整的。FIFO深度取两行,因为晶振偏差积累一帧也到不了一行,留一行余量够用。面试官追问时,你提一句用BRAM做双端口FIFO,还能省LUT。别去死记深度公式,现场算一下1920242,面试官看你心算快反而加分。你目前是在准备秋招还是春招?不同阶段面试官对代码完整度要求差挺多的。

  • 代码小萌新

    我去年秋招面过类似题,面试官当场说了一句对我启发很大的话:帧对齐不是在时间轴上对齐,是在数据流上对齐。你每路输入先把VSYNC打成TUSER的帧起始标记,写到FIFO里,读端等所有路都读到了这个标记,才开始按顺序出数据。这样哪怕各路帧起始差了几百个时钟周期,输出画面也是完整的。FIFO深度取两行,因为晶振偏差积累一帧也到不了一行,留一行余量够用。面试官追问时,你提一句用BRAM做双端口FIFO,还能省LUT。别去死记深度公式,现场算一下1920242,面试官看你心算快反而加分。你目前是在准备秋招还是春招?不同阶段面试官对代码完整度要求差挺多的。

  • FPGA学号2

    漏帧的核心是写时钟和读时钟不同步,不是你代码写得不够花哨。四路1080P60,每路像素时钟差几十ppm,一帧下来偏移不到一个像素,真正要防的是帧起始偏差。你每路FIFO深度设成两行加一个像素就够了,读端等所有路都写满一行再统一读,别等整帧。面试官要听的是你怎么处理那个"等"的时机,不是背FIFO深度公式。你用的开发板是Xilinx还是Intel的?BRAM原语写法不一样,代码框架差别挺大的。

登录后可在本页底部提交回答

提问者

电子爱好者小李查看主页
浏览「其他」

描述场景与已尝试方案,更容易获得有效解答

相关问题

同分类

提问建议

  • 标题写清核心疑问,避免「求助」「请问」等空泛用语
  • 正文补充环境、版本、报错信息或截图
  • 先搜索本站是否已有相近问题,减少重复提问
  • 若与课程相关,请标明课时或章节便于讲师定位